{"text_format":"1","workbook":"xlsx","n_sheets":4,"sheets":["ZREBOVANIE","rozhozeni","varianty","Hárok9"],"not_rendered":{"charts":0,"images":0,"macros":1,"external_links":0,"defined_names":1,"comments":0,"pivot_tables":0},"unopened":[],"bounds":{"document_bytes":16777216,"sheet_cells":100000,"rows_first":2000,"rows_last":500,"rows_between":2000,"halvings":0,"cell_chars":16384,"cell_head_chars":4096},"cells_cut":0,"cells_raw":0,"read":"whole","date_system":"1900"}

{"sheet":"ZREBOVANIE","index":0,"n_rows":51,"n_cols":21,"rows_kept":51,"cut":false,"hidden":false,"merged":[]}
["S/L","Stanoviště","kolo1","kolo2","kolo3","kolo4","kolo5","kolo6","kolo7","kolo8",null,"počet pretekárov",48,"POSUN",9,null,null,"zavodnikuVzorec",{"$f":"IF(MOD($M$1,2)=0,$M$1,$M$1+1)","v":48},"lichý",{"$f":"MOD(M1,2)","v":0}]
[{"$f":"MOD(B2,2)","v":1},1,{"$f":"B2","v":1},{"$f":"IF(C2+$O$1>$S$1,C2+$O$1-$S$1,C2+$O$1)","v":10},{"$f":"IF(D2+$O$1>$S$1,D2+$O$1-$S$1,D2+$O$1)","v":19},{"$f":"IF(E2+$O$1>$S$1,E2+$O$1-$S$1,E2+$O$1)","v":28},{"$f":"IF(F2+$O$1>$S$1,F2+$O$1-$S$1,F2+$O$1)","v":37},{"$f":"IF(G2+$O$1>$S$1,G2+$O$1-$S$1,G2+$O$1)","v":46},{"$f":"IF(H2+$O$1>$S$1,H2+$O$1-$S$1,H2+$O$1)","v":7},{"$f":"IF(I2+$O$1>$S$1,I2+$O$1-$S$1,I2+$O$1)","v":16}]
[{"$f":"MOD(B3,2)","v":0},2,{"$f":"B3","v":2},{"$f":"IF(C3-$O$1<=0,$S$1-$O$1+C3,C3-$O$1)","v":41},{"$f":"IF(D3-$O$1<=0,$S$1-$O$1+D3,D3-$O$1)","v":32},{"$f":"IF(E3-$O$1<=0,$S$1-$O$1+E3,E3-$O$1)","v":23},{"$f":"IF(F3-$O$1<=0,$S$1-$O$1+F3,F3-$O$1)","v":14},{"$f":"IF(G3-$O$1<=0,$S$1-$O$1+G3,G3-$O$1)","v":5},{"$f":"IF(H3-$O$1<=0,$S$1-$O$1+H3,H3-$O$1)","v":44},{"$f":"IF(I3-$O$1<=0,$S$1-$O$1+I3,I3-$O$1)","v":35}]
[{"$f":"MOD(B4,2)","v":1},3,{"$f":"B4","v":3},{"$f":"IF(C4+$O$1>$S$1,C4+$O$1-$S$1,C4+$O$1)","v":12},{"$f":"IF(D4+$O$1>$S$1,D4+$O$1-$S$1,D4+$O$1)","v":21},{"$f":"IF(E4+$O$1>$S$1,E4+$O$1-$S$1,E4+$O$1)","v":30},{"$f":"IF(F4+$O$1>$S$1,F4+$O$1-$S$1,F4+$O$1)","v":39},{"$f":"IF(G4+$O$1>$S$1,G4+$O$1-$S$1,G4+$O$1)","v":48},{"$f":"IF(H4+$O$1>$S$1,H4+$O$1-$S$1,H4+$O$1)","v":9},{"$f":"IF(I4+$O$1>$S$1,I4+$O$1-$S$1,I4+$O$1)","v":18}]
[{"$f":"MOD(B5,2)","v":0},4,{"$f":"B5","v":4},{"$f":"IF(C5-$O$1<=0,$S$1-$O$1+C5,C5-$O$1)","v":43},{"$f":"IF(D5-$O$1<=0,$S$1-$O$1+D5,D5-$O$1)","v":34},{"$f":"IF(E5-$O$1<=0,$S$1-$O$1+E5,E5-$O$1)","v":25},{"$f":"IF(F5-$O$1<=0,$S$1-$O$1+F5,F5-$O$1)","v":16},{"$f":"IF(G5-$O$1<=0,$S$1-$O$1+G5,G5-$O$1)","v":7},{"$f":"IF(H5-$O$1<=0,$S$1-$O$1+H5,H5-$O$1)","v":46},{"$f":"IF(I5-$O$1<=0,$S$1-$O$1+I5,I5-$O$1)","v":37}]
[{"$f":"MOD(B6,2)","v":1},5,{"$f":"B6","v":5},{"$f":"IF(C6+$O$1>$S$1,C6+$O$1-$S$1,C6+$O$1)","v":14},{"$f":"IF(D6+$O$1>$S$1,D6+$O$1-$S$1,D6+$O$1)","v":23},{"$f":"IF(E6+$O$1>$S$1,E6+$O$1-$S$1,E6+$O$1)","v":32},{"$f":"IF(F6+$O$1>$S$1,F6+$O$1-$S$1,F6+$O$1)","v":41},{"$f":"IF(G6+$O$1>$S$1,G6+$O$1-$S$1,G6+$O$1)","v":2},{"$f":"IF(H6+$O$1>$S$1,H6+$O$1-$S$1,H6+$O$1)","v":11},{"$f":"IF(I6+$O$1>$S$1,I6+$O$1-$S$1,I6+$O$1)","v":20}]
[{"$f":"MOD(B7,2)","v":0},6,{"$f":"B7","v":6},{"$f":"IF(C7-$O$1<=0,$S$1-$O$1+C7,C7-$O$1)","v":45},{"$f":"IF(D7-$O$1<=0,$S$1-$O$1+D7,D7-$O$1)","v":36},{"$f":"IF(E7-$O$1<=0,$S$1-$O$1+E7,E7-$O$1)","v":27},{"$f":"IF(F7-$O$1<=0,$S$1-$O$1+F7,F7-$O$1)","v":18},{"$f":"IF(G7-$O$1<=0,$S$1-$O$1+G7,G7-$O$1)","v":9},{"$f":"IF(H7-$O$1<=0,$S$1-$O$1+H7,H7-$O$1)","v":48},{"$f":"IF(I7-$O$1<=0,$S$1-$O$1+I7,I7-$O$1)","v":39}]
[{"$f":"MOD(B8,2)","v":1},7,{"$f":"B8","v":7},{"$f":"IF(C8+$O$1>$S$1,C8+$O$1-$S$1,C8+$O$1)","v":16},{"$f":"IF(D8+$O$1>$S$1,D8+$O$1-$S$1,D8+$O$1)","v":25},{"$f":"IF(E8+$O$1>$S$1,E8+$O$1-$S$1,E8+$O$1)","v":34},{"$f":"IF(F8+$O$1>$S$1,F8+$O$1-$S$1,F8+$O$1)","v":43},{"$f":"IF(G8+$O$1>$S$1,G8+$O$1-$S$1,G8+$O$1)","v":4},{"$f":"IF(H8+$O$1>$S$1,H8+$O$1-$S$1,H8+$O$1)","v":13},{"$f":"IF(I8+$O$1>$S$1,I8+$O$1-$S$1,I8+$O$1)","v":22}]
[{"$f":"MOD(B9,2)","v":0},8,{"$f":"B9","v":8},{"$f":"IF(C9-$O$1<=0,$S$1-$O$1+C9,C9-$O$1)","v":47},{"$f":"IF(D9-$O$1<=0,$S$1-$O$1+D9,D9-$O$1)","v":38},{"$f":"IF(E9-$O$1<=0,$S$1-$O$1+E9,E9-$O$1)","v":29},{"$f":"IF(F9-$O$1<=0,$S$1-$O$1+F9,F9-$O$1)","v":20},{"$f":"IF(G9-$O$1<=0,$S$1-$O$1+G9,G9-$O$1)","v":11},{"$f":"IF(H9-$O$1<=0,$S$1-$O$1+H9,H9-$O$1)","v":2},{"$f":"IF(I9-$O$1<=0,$S$1-$O$1+I9,I9-$O$1)","v":41}]
[{"$f":"MOD(B10,2)","v":1},9,{"$f":"B10","v":9},{"$f":"IF(C10+$O$1>$S$1,C10+$O$1-$S$1,C10+$O$1)","v":18},{"$f":"IF(D10+$O$1>$S$1,D10+$O$1-$S$1,D10+$O$1)","v":27},{"$f":"IF(E10+$O$1>$S$1,E10+$O$1-$S$1,E10+$O$1)","v":36},{"$f":"IF(F10+$O$1>$S$1,F10+$O$1-$S$1,F10+$O$1)","v":45},{"$f":"IF(G10+$O$1>$S$1,G10+$O$1-$S$1,G10+$O$1)","v":6},{"$f":"IF(H10+$O$1>$S$1,H10+$O$1-$S$1,H10+$O$1)","v":15},{"$f":"IF(I10+$O$1>$S$1,I10+$O$1-$S$1,I10+$O$1)","v":24}]
[{"$f":"MOD(B11,2)","v":0},10,{"$f":"B11","v":10},{"$f":"IF(C11-$O$1<=0,$S$1-$O$1+C11,C11-$O$1)","v":1},{"$f":"IF(D11-$O$1<=0,$S$1-$O$1+D11,D11-$O$1)","v":40},{"$f":"IF(E11-$O$1<=0,$S$1-$O$1+E11,E11-$O$1)","v":31},{"$f":"IF(F11-$O$1<=0,$S$1-$O$1+F11,F11-$O$1)","v":22},{"$f":"IF(G11-$O$1<=0,$S$1-$O$1+G11,G11-$O$1)","v":13},{"$f":"IF(H11-$O$1<=0,$S$1-$O$1+H11,H11-$O$1)","v":4},{"$f":"IF(I11-$O$1<=0,$S$1-$O$1+I11,I11-$O$1)","v":43}]
[{"$f":"MOD(B12,2)","v":1},11,{"$f":"B12","v":11},{"$f":"IF(C12+$O$1>$S$1,C12+$O$1-$S$1,C12+$O$1)","v":20},{"$f":"IF(D12+$O$1>$S$1,D12+$O$1-$S$1,D12+$O$1)","v":29},{"$f":"IF(E12+$O$1>$S$1,E12+$O$1-$S$1,E12+$O$1)","v":38},{"$f":"IF(F12+$O$1>$S$1,F12+$O$1-$S$1,F12+$O$1)","v":47},{"$f":"IF(G12+$O$1>$S$1,G12+$O$1-$S$1,G12+$O$1)","v":8},{"$f":"IF(H12+$O$1>$S$1,H12+$O$1-$S$1,H12+$O$1)","v":17},{"$f":"IF(I12+$O$1>$S$1,I12+$O$1-$S$1,I12+$O$1)","v":26}]
[{"$f":"MOD(B13,2)","v":0},12,{"$f":"B13","v":12},{"$f":"IF(C13-$O$1<=0,$S$1-$O$1+C13,C13-$O$1)","v":3},{"$f":"IF(D13-$O$1<=0,$S$1-$O$1+D13,D13-$O$1)","v":42},{"$f":"IF(E13-$O$1<=0,$S$1-$O$1+E13,E13-$O$1)","v":33},{"$f":"IF(F13-$O$1<=0,$S$1-$O$1+F13,F13-$O$1)","v":24},{"$f":"IF(G13-$O$1<=0,$S$1-$O$1+G13,G13-$O$1)","v":15},{"$f":"IF(H13-$O$1<=0,$S$1-$O$1+H13,H13-$O$1)","v":6},{"$f":"IF(I13-$O$1<=0,$S$1-$O$1+I13,I13-$O$1)","v":45}]
[{"$f":"MOD(B14,2)","v":1},13,{"$f":"B14","v":13},{"$f":"IF(C14+$O$1>$S$1,C14+$O$1-$S$1,C14+$O$1)","v":22},{"$f":"IF(D14+$O$1>$S$1,D14+$O$1-$S$1,D14+$O$1)","v":31},{"$f":"IF(E14+$O$1>$S$1,E14+$O$1-$S$1,E14+$O$1)","v":40},{"$f":"IF(F14+$O$1>$S$1,F14+$O$1-$S$1,F14+$O$1)","v":1},{"$f":"IF(G14+$O$1>$S$1,G14+$O$1-$S$1,G14+$O$1)","v":10},{"$f":"IF(H14+$O$1>$S$1,H14+$O$1-$S$1,H14+$O$1)","v":19},{"$f":"IF(I14+$O$1>$S$1,I14+$O$1-$S$1,I14+$O$1)","v":28}]
[{"$f":"MOD(B15,2)","v":0},14,{"$f":"B15","v":14},{"$f":"IF(C15-$O$1<=0,$S$1-$O$1+C15,C15-$O$1)","v":5},{"$f":"IF(D15-$O$1<=0,$S$1-$O$1+D15,D15-$O$1)","v":44},{"$f":"IF(E15-$O$1<=0,$S$1-$O$1+E15,E15-$O$1)","v":35},{"$f":"IF(F15-$O$1<=0,$S$1-$O$1+F15,F15-$O$1)","v":26},{"$f":"IF(G15-$O$1<=0,$S$1-$O$1+G15,G15-$O$1)","v":17},{"$f":"IF(H15-$O$1<=0,$S$1-$O$1+H15,H15-$O$1)","v":8},{"$f":"IF(I15-$O$1<=0,$S$1-$O$1+I15,I15-$O$1)","v":47}]
[{"$f":"MOD(B16,2)","v":1},15,{"$f":"B16","v":15},{"$f":"IF(C16+$O$1>$S$1,C16+$O$1-$S$1,C16+$O$1)","v":24},{"$f":"IF(D16+$O$1>$S$1,D16+$O$1-$S$1,D16+$O$1)","v":33},{"$f":"IF(E16+$O$1>$S$1,E16+$O$1-$S$1,E16+$O$1)","v":42},{"$f":"IF(F16+$O$1>$S$1,F16+$O$1-$S$1,F16+$O$1)","v":3},{"$f":"IF(G16+$O$1>$S$1,G16+$O$1-$S$1,G16+$O$1)","v":12},{"$f":"IF(H16+$O$1>$S$1,H16+$O$1-$S$1,H16+$O$1)","v":21},{"$f":"IF(I16+$O$1>$S$1,I16+$O$1-$S$1,I16+$O$1)","v":30}]
[{"$f":"MOD(B17,2)","v":0},16,{"$f":"B17","v":16},{"$f":"IF(C17-$O$1<=0,$S$1-$O$1+C17,C17-$O$1)","v":7},{"$f":"IF(D17-$O$1<=0,$S$1-$O$1+D17,D17-$O$1)","v":46},{"$f":"IF(E17-$O$1<=0,$S$1-$O$1+E17,E17-$O$1)","v":37},{"$f":"IF(F17-$O$1<=0,$S$1-$O$1+F17,F17-$O$1)","v":28},{"$f":"IF(G17-$O$1<=0,$S$1-$O$1+G17,G17-$O$1)","v":19},{"$f":"IF(H17-$O$1<=0,$S$1-$O$1+H17,H17-$O$1)","v":10},{"$f":"IF(I17-$O$1<=0,$S$1-$O$1+I17,I17-$O$1)","v":1}]
[{"$f":"MOD(B18,2)","v":1},17,{"$f":"B18","v":17},{"$f":"IF(C18+$O$1>$S$1,C18+$O$1-$S$1,C18+$O$1)","v":26},{"$f":"IF(D18+$O$1>$S$1,D18+$O$1-$S$1,D18+$O$1)","v":35},{"$f":"IF(E18+$O$1>$S$1,E18+$O$1-$S$1,E18+$O$1)","v":44},{"$f":"IF(F18+$O$1>$S$1,F18+$O$1-$S$1,F18+$O$1)","v":5},{"$f":"IF(G18+$O$1>$S$1,G18+$O$1-$S$1,G18+$O$1)","v":14},{"$f":"IF(H18+$O$1>$S$1,H18+$O$1-$S$1,H18+$O$1)","v":23},{"$f":"IF(I18+$O$1>$S$1,I18+$O$1-$S$1,I18+$O$1)","v":32}]
[{"$f":"MOD(B19,2)","v":0},18,{"$f":"B19","v":18},{"$f":"IF(C19-$O$1<=0,$S$1-$O$1+C19,C19-$O$1)","v":9},{"$f":"IF(D19-$O$1<=0,$S$1-$O$1+D19,D19-$O$1)","v":48},{"$f":"IF(E19-$O$1<=0,$S$1-$O$1+E19,E19-$O$1)","v":39},{"$f":"IF(F19-$O$1<=0,$S$1-$O$1+F19,F19-$O$1)","v":30},{"$f":"IF(G19-$O$1<=0,$S$1-$O$1+G19,G19-$O$1)","v":21},{"$f":"IF(H19-$O$1<=0,$S$1-$O$1+H19,H19-$O$1)","v":12},{"$f":"IF(I19-$O$1<=0,$S$1-$O$1+I19,I19-$O$1)","v":3}]
[{"$f":"MOD(B20,2)","v":1},19,{"$f":"B20","v":19},{"$f":"IF(C20+$O$1>$S$1,C20+$O$1-$S$1,C20+$O$1)","v":28},{"$f":"IF(D20+$O$1>$S$1,D20+$O$1-$S$1,D20+$O$1)","v":37},{"$f":"IF(E20+$O$1>$S$1,E20+$O$1-$S$1,E20+$O$1)","v":46},{"$f":"IF(F20+$O$1>$S$1,F20+$O$1-$S$1,F20+$O$1)","v":7},{"$f":"IF(G20+$O$1>$S$1,G20+$O$1-$S$1,G20+$O$1)","v":16},{"$f":"IF(H20+$O$1>$S$1,H20+$O$1-$S$1,H20+$O$1)","v":25},{"$f":"IF(I20+$O$1>$S$1,I20+$O$1-$S$1,I20+$O$1)","v":34}]
[{"$f":"MOD(B21,2)","v":0},20,{"$f":"B21","v":20},{"$f":"IF(C21-$O$1<=0,$S$1-$O$1+C21,C21-$O$1)","v":11},{"$f":"IF(D21-$O$1<=0,$S$1-$O$1+D21,D21-$O$1)","v":2},{"$f":"IF(E21-$O$1<=0,$S$1-$O$1+E21,E21-$O$1)","v":41},{"$f":"IF(F21-$O$1<=0,$S$1-$O$1+F21,F21-$O$1)","v":32},{"$f":"IF(G21-$O$1<=0,$S$1-$O$1+G21,G21-$O$1)","v":23},{"$f":"IF(H21-$O$1<=0,$S$1-$O$1+H21,H21-$O$1)","v":14},{"$f":"IF(I21-$O$1<=0,$S$1-$O$1+I21,I21-$O$1)","v":5}]
[{"$f":"MOD(B22,2)","v":1},21,{"$f":"B22","v":21},{"$f":"IF(C22+$O$1>$S$1,C22+$O$1-$S$1,C22+$O$1)","v":30},{"$f":"IF(D22+$O$1>$S$1,D22+$O$1-$S$1,D22+$O$1)","v":39},{"$f":"IF(E22+$O$1>$S$1,E22+$O$1-$S$1,E22+$O$1)","v":48},{"$f":"IF(F22+$O$1>$S$1,F22+$O$1-$S$1,F22+$O$1)","v":9},{"$f":"IF(G22+$O$1>$S$1,G22+$O$1-$S$1,G22+$O$1)","v":18},{"$f":"IF(H22+$O$1>$S$1,H22+$O$1-$S$1,H22+$O$1)","v":27},{"$f":"IF(I22+$O$1>$S$1,I22+$O$1-$S$1,I22+$O$1)","v":36}]
[{"$f":"MOD(B23,2)","v":0},22,{"$f":"B23","v":22},{"$f":"IF(C23-$O$1<=0,$S$1-$O$1+C23,C23-$O$1)","v":13},{"$f":"IF(D23-$O$1<=0,$S$1-$O$1+D23,D23-$O$1)","v":4},{"$f":"IF(E23-$O$1<=0,$S$1-$O$1+E23,E23-$O$1)","v":43},{"$f":"IF(F23-$O$1<=0,$S$1-$O$1+F23,F23-$O$1)","v":34},{"$f":"IF(G23-$O$1<=0,$S$1-$O$1+G23,G23-$O$1)","v":25},{"$f":"IF(H23-$O$1<=0,$S$1-$O$1+H23,H23-$O$1)","v":16},{"$f":"IF(I23-$O$1<=0,$S$1-$O$1+I23,I23-$O$1)","v":7}]
[{"$f":"MOD(B24,2)","v":1},23,{"$f":"B24","v":23},{"$f":"IF(C24+$O$1>$S$1,C24+$O$1-$S$1,C24+$O$1)","v":32},{"$f":"IF(D24+$O$1>$S$1,D24+$O$1-$S$1,D24+$O$1)","v":41},{"$f":"IF(E24+$O$1>$S$1,E24+$O$1-$S$1,E24+$O$1)","v":2},{"$f":"IF(F24+$O$1>$S$1,F24+$O$1-$S$1,F24+$O$1)","v":11},{"$f":"IF(G24+$O$1>$S$1,G24+$O$1-$S$1,G24+$O$1)","v":20},{"$f":"IF(H24+$O$1>$S$1,H24+$O$1-$S$1,H24+$O$1)","v":29},{"$f":"IF(I24+$O$1>$S$1,I24+$O$1-$S$1,I24+$O$1)","v":38}]
[{"$f":"MOD(B25,2)","v":0},24,{"$f":"B25","v":24},{"$f":"IF(C25-$O$1<=0,$S$1-$O$1+C25,C25-$O$1)","v":15},{"$f":"IF(D25-$O$1<=0,$S$1-$O$1+D25,D25-$O$1)","v":6},{"$f":"IF(E25-$O$1<=0,$S$1-$O$1+E25,E25-$O$1)","v":45},{"$f":"IF(F25-$O$1<=0,$S$1-$O$1+F25,F25-$O$1)","v":36},{"$f":"IF(G25-$O$1<=0,$S$1-$O$1+G25,G25-$O$1)","v":27},{"$f":"IF(H25-$O$1<=0,$S$1-$O$1+H25,H25-$O$1)","v":18},{"$f":"IF(I25-$O$1<=0,$S$1-$O$1+I25,I25-$O$1)","v":9}]
[{"$f":"MOD(B26,2)","v":1},25,{"$f":"B26","v":25},{"$f":"IF(C26+$O$1>$S$1,C26+$O$1-$S$1,C26+$O$1)","v":34},{"$f":"IF(D26+$O$1>$S$1,D26+$O$1-$S$1,D26+$O$1)","v":43},{"$f":"IF(E26+$O$1>$S$1,E26+$O$1-$S$1,E26+$O$1)","v":4},{"$f":"IF(F26+$O$1>$S$1,F26+$O$1-$S$1,F26+$O$1)","v":13},{"$f":"IF(G26+$O$1>$S$1,G26+$O$1-$S$1,G26+$O$1)","v":22},{"$f":"IF(H26+$O$1>$S$1,H26+$O$1-$S$1,H26+$O$1)","v":31},{"$f":"IF(I26+$O$1>$S$1,I26+$O$1-$S$1,I26+$O$1)","v":40}]
[{"$f":"MOD(B27,2)","v":0},26,{"$f":"B27","v":26},{"$f":"IF(C27-$O$1<=0,$S$1-$O$1+C27,C27-$O$1)","v":17},{"$f":"IF(D27-$O$1<=0,$S$1-$O$1+D27,D27-$O$1)","v":8},{"$f":"IF(E27-$O$1<=0,$S$1-$O$1+E27,E27-$O$1)","v":47},{"$f":"IF(F27-$O$1<=0,$S$1-$O$1+F27,F27-$O$1)","v":38},{"$f":"IF(G27-$O$1<=0,$S$1-$O$1+G27,G27-$O$1)","v":29},{"$f":"IF(H27-$O$1<=0,$S$1-$O$1+H27,H27-$O$1)","v":20},{"$f":"IF(I27-$O$1<=0,$S$1-$O$1+I27,I27-$O$1)","v":11}]
[{"$f":"MOD(B28,2)","v":1},27,{"$f":"B28","v":27},{"$f":"IF(C28+$O$1>$S$1,C28+$O$1-$S$1,C28+$O$1)","v":36},{"$f":"IF(D28+$O$1>$S$1,D28+$O$1-$S$1,D28+$O$1)","v":45},{"$f":"IF(E28+$O$1>$S$1,E28+$O$1-$S$1,E28+$O$1)","v":6},{"$f":"IF(F28+$O$1>$S$1,F28+$O$1-$S$1,F28+$O$1)","v":15},{"$f":"IF(G28+$O$1>$S$1,G28+$O$1-$S$1,G28+$O$1)","v":24},{"$f":"IF(H28+$O$1>$S$1,H28+$O$1-$S$1,H28+$O$1)","v":33},{"$f":"IF(I28+$O$1>$S$1,I28+$O$1-$S$1,I28+$O$1)","v":42}]
[{"$f":"MOD(B29,2)","v":0},28,{"$f":"B29","v":28},{"$f":"IF(C29-$O$1<=0,$S$1-$O$1+C29,C29-$O$1)","v":19},{"$f":"IF(D29-$O$1<=0,$S$1-$O$1+D29,D29-$O$1)","v":10},{"$f":"IF(E29-$O$1<=0,$S$1-$O$1+E29,E29-$O$1)","v":1},{"$f":"IF(F29-$O$1<=0,$S$1-$O$1+F29,F29-$O$1)","v":40},{"$f":"IF(G29-$O$1<=0,$S$1-$O$1+G29,G29-$O$1)","v":31},{"$f":"IF(H29-$O$1<=0,$S$1-$O$1+H29,H29-$O$1)","v":22},{"$f":"IF(I29-$O$1<=0,$S$1-$O$1+I29,I29-$O$1)","v":13}]
[{"$f":"MOD(B30,2)","v":1},29,{"$f":"B30","v":29},{"$f":"IF(C30+$O$1>$S$1,C30+$O$1-$S$1,C30+$O$1)","v":38},{"$f":"IF(D30+$O$1>$S$1,D30+$O$1-$S$1,D30+$O$1)","v":47},{"$f":"IF(E30+$O$1>$S$1,E30+$O$1-$S$1,E30+$O$1)","v":8},{"$f":"IF(F30+$O$1>$S$1,F30+$O$1-$S$1,F30+$O$1)","v":17},{"$f":"IF(G30+$O$1>$S$1,G30+$O$1-$S$1,G30+$O$1)","v":26},{"$f":"IF(H30+$O$1>$S$1,H30+$O$1-$S$1,H30+$O$1)","v":35},{"$f":"IF(I30+$O$1>$S$1,I30+$O$1-$S$1,I30+$O$1)","v":44}]
["x",30,{"$f":"B31","v":30},{"$f":"IF(C31-$O$1<=0,$S$1-$O$1+C31,C31-$O$1)","v":21},{"$f":"IF(D31-$O$1<=0,$S$1-$O$1+D31,D31-$O$1)","v":12},{"$f":"IF(E31-$O$1<=0,$S$1-$O$1+E31,E31-$O$1)","v":3},{"$f":"IF(F31-$O$1<=0,$S$1-$O$1+F31,F31-$O$1)","v":42},{"$f":"IF(G31-$O$1<=0,$S$1-$O$1+G31,G31-$O$1)","v":33},{"$f":"IF(H31-$O$1<=0,$S$1-$O$1+H31,H31-$O$1)","v":24},{"$f":"IF(I31-$O$1<=0,$S$1-$O$1+I31,I31-$O$1)","v":15}]
["x",{"$f":"IF(ROW(B32)-1<=$S$1,ROW(B32)-1,\"x\")","v":31},{"$f":"B32","v":31},{"$f":"IFERROR(IF(C32+$O$1>$S$1,C32+$O$1-$S$1,C32+$O$1),\"x\")","v":40},{"$f":"IFERROR(IF(D32+$O$1>$S$1,D32+$O$1-$S$1,D32+$O$1),\"x\")","v":1},{"$f":"IFERROR(IF(E32+$O$1>$S$1,E32+$O$1-$S$1,E32+$O$1),\"x\")","v":10},{"$f":"IFERROR(IF(F32+$O$1>$S$1,F32+$O$1-$S$1,F32+$O$1),\"x\")","v":19},{"$f":"IFERROR(IF(G32+$O$1>$S$1,G32+$O$1-$S$1,G32+$O$1),\"x\")","v":28},{"$f":"IFERROR(IF(H32+$O$1>$S$1,H32+$O$1-$S$1,H32+$O$1),\"x\")","v":37},{"$f":"IFERROR(IF(I32+$O$1>$S$1,I32+$O$1-$S$1,I32+$O$1),\"x\")","v":46}]
["x",{"$f":"IF(ROW(B33)-1<=$S$1,ROW(B33)-1,\"x\")","v":32},{"$f":"B33","v":32},{"$f":"IFERROR(IF(C33-$O$1<=0,$S$1-$O$1+C33,C33-$O$1),\"x\")","v":23},{"$f":"IFERROR(IF(D33-$O$1<=0,$S$1-$O$1+D33,D33-$O$1),\"x\")","v":14},{"$f":"IFERROR(IF(E33-$O$1<=0,$S$1-$O$1+E33,E33-$O$1),\"x\")","v":5},{"$f":"IFERROR(IF(F33-$O$1<=0,$S$1-$O$1+F33,F33-$O$1),\"x\")","v":44},{"$f":"IFERROR(IF(G33-$O$1<=0,$S$1-$O$1+G33,G33-$O$1),\"x\")","v":35},{"$f":"IFERROR(IF(H33-$O$1<=0,$S$1-$O$1+H33,H33-$O$1),\"x\")","v":26},{"$f":"IFERROR(IF(I33-$O$1<=0,$S$1-$O$1+I33,I33-$O$1),\"x\")","v":17}]
["x",{"$f":"IF(ROW(B34)-1<=$S$1,ROW(B34)-1,\"x\")","v":33},{"$f":"B34","v":33},{"$f":"IFERROR(IF(C34+$O$1>$S$1,C34+$O$1-$S$1,C34+$O$1),\"x\")","v":42},{"$f":"IFERROR(IF(D34+$O$1>$S$1,D34+$O$1-$S$1,D34+$O$1),\"x\")","v":3},{"$f":"IFERROR(IF(E34+$O$1>$S$1,E34+$O$1-$S$1,E34+$O$1),\"x\")","v":12},{"$f":"IFERROR(IF(F34+$O$1>$S$1,F34+$O$1-$S$1,F34+$O$1),\"x\")","v":21},{"$f":"IFERROR(IF(G34+$O$1>$S$1,G34+$O$1-$S$1,G34+$O$1),\"x\")","v":30},{"$f":"IFERROR(IF(H34+$O$1>$S$1,H34+$O$1-$S$1,H34+$O$1),\"x\")","v":39},{"$f":"IFERROR(IF(I34+$O$1>$S$1,I34+$O$1-$S$1,I34+$O$1),\"x\")","v":48}]
["x",{"$f":"IF(ROW(B35)-1<=$S$1,ROW(B35)-1,\"x\")","v":34},{"$f":"B35","v":34},{"$f":"IFERROR(IF(C35-$O$1<=0,$S$1-$O$1+C35,C35-$O$1),\"x\")","v":25},{"$f":"IFERROR(IF(D35-$O$1<=0,$S$1-$O$1+D35,D35-$O$1),\"x\")","v":16},{"$f":"IFERROR(IF(E35-$O$1<=0,$S$1-$O$1+E35,E35-$O$1),\"x\")","v":7},{"$f":"IFERROR(IF(F35-$O$1<=0,$S$1-$O$1+F35,F35-$O$1),\"x\")","v":46},{"$f":"IFERROR(IF(G35-$O$1<=0,$S$1-$O$1+G35,G35-$O$1),\"x\")","v":37},{"$f":"IFERROR(IF(H35-$O$1<=0,$S$1-$O$1+H35,H35-$O$1),\"x\")","v":28},{"$f":"IFERROR(IF(I35-$O$1<=0,$S$1-$O$1+I35,I35-$O$1),\"x\")","v":19}]
["x",{"$f":"IF(ROW(B36)-1<=$S$1,ROW(B36)-1,\"x\")","v":35},{"$f":"B36","v":35},{"$f":"IFERROR(IF(C36+$O$1>$S$1,C36+$O$1-$S$1,C36+$O$1),\"x\")","v":44},{"$f":"IFERROR(IF(D36+$O$1>$S$1,D36+$O$1-$S$1,D36+$O$1),\"x\")","v":5},{"$f":"IFERROR(IF(E36+$O$1>$S$1,E36+$O$1-$S$1,E36+$O$1),\"x\")","v":14},{"$f":"IFERROR(IF(F36+$O$1>$S$1,F36+$O$1-$S$1,F36+$O$1),\"x\")","v":23},{"$f":"IFERROR(IF(G36+$O$1>$S$1,G36+$O$1-$S$1,G36+$O$1),\"x\")","v":32},{"$f":"IFERROR(IF(H36+$O$1>$S$1,H36+$O$1-$S$1,H36+$O$1),\"x\")","v":41},{"$f":"IFERROR(IF(I36+$O$1>$S$1,I36+$O$1-$S$1,I36+$O$1),\"x\")","v":2}]
["x",{"$f":"IF(ROW(B37)-1<=$S$1,ROW(B37)-1,\"x\")","v":36},{"$f":"B37","v":36},{"$f":"IFERROR(IF(C37-$O$1<=0,$S$1-$O$1+C37,C37-$O$1),\"x\")","v":27},{"$f":"IFERROR(IF(D37-$O$1<=0,$S$1-$O$1+D37,D37-$O$1),\"x\")","v":18},{"$f":"IFERROR(IF(E37-$O$1<=0,$S$1-$O$1+E37,E37-$O$1),\"x\")","v":9},{"$f":"IFERROR(IF(F37-$O$1<=0,$S$1-$O$1+F37,F37-$O$1),\"x\")","v":48},{"$f":"IFERROR(IF(G37-$O$1<=0,$S$1-$O$1+G37,G37-$O$1),\"x\")","v":39},{"$f":"IFERROR(IF(H37-$O$1<=0,$S$1-$O$1+H37,H37-$O$1),\"x\")","v":30},{"$f":"IFERROR(IF(I37-$O$1<=0,$S$1-$O$1+I37,I37-$O$1),\"x\")","v":21}]
["x",{"$f":"IF(ROW(B38)-1<=$S$1,ROW(B38)-1,\"x\")","v":37},{"$f":"B38","v":37},{"$f":"IFERROR(IF(C38+$O$1>$S$1,C38+$O$1-$S$1,C38+$O$1),\"x\")","v":46},{"$f":"IFERROR(IF(D38+$O$1>$S$1,D38+$O$1-$S$1,D38+$O$1),\"x\")","v":7},{"$f":"IFERROR(IF(E38+$O$1>$S$1,E38+$O$1-$S$1,E38+$O$1),\"x\")","v":16},{"$f":"IFERROR(IF(F38+$O$1>$S$1,F38+$O$1-$S$1,F38+$O$1),\"x\")","v":25},{"$f":"IFERROR(IF(G38+$O$1>$S$1,G38+$O$1-$S$1,G38+$O$1),\"x\")","v":34},{"$f":"IFERROR(IF(H38+$O$1>$S$1,H38+$O$1-$S$1,H38+$O$1),\"x\")","v":43},{"$f":"IFERROR(IF(I38+$O$1>$S$1,I38+$O$1-$S$1,I38+$O$1),\"x\")","v":4}]
["x",{"$f":"IF(ROW(B39)-1<=$S$1,ROW(B39)-1,\"x\")","v":38},{"$f":"B39","v":38},{"$f":"IFERROR(IF(C39-$O$1<=0,$S$1-$O$1+C39,C39-$O$1),\"x\")","v":29},{"$f":"IFERROR(IF(D39-$O$1<=0,$S$1-$O$1+D39,D39-$O$1),\"x\")","v":20},{"$f":"IFERROR(IF(E39-$O$1<=0,$S$1-$O$1+E39,E39-$O$1),\"x\")","v":11},{"$f":"IFERROR(IF(F39-$O$1<=0,$S$1-$O$1+F39,F39-$O$1),\"x\")","v":2},{"$f":"IFERROR(IF(G39-$O$1<=0,$S$1-$O$1+G39,G39-$O$1),\"x\")","v":41},{"$f":"IFERROR(IF(H39-$O$1<=0,$S$1-$O$1+H39,H39-$O$1),\"x\")","v":32},{"$f":"IFERROR(IF(I39-$O$1<=0,$S$1-$O$1+I39,I39-$O$1),\"x\")","v":23}]
["x",{"$f":"IF(ROW(B40)-1<=$S$1,ROW(B40)-1,\"x\")","v":39},{"$f":"B40","v":39},{"$f":"IFERROR(IF(C40+$O$1>$S$1,C40+$O$1-$S$1,C40+$O$1),\"x\")","v":48},{"$f":"IFERROR(IF(D40+$O$1>$S$1,D40+$O$1-$S$1,D40+$O$1),\"x\")","v":9},{"$f":"IFERROR(IF(E40+$O$1>$S$1,E40+$O$1-$S$1,E40+$O$1),\"x\")","v":18},{"$f":"IFERROR(IF(F40+$O$1>$S$1,F40+$O$1-$S$1,F40+$O$1),\"x\")","v":27},{"$f":"IFERROR(IF(G40+$O$1>$S$1,G40+$O$1-$S$1,G40+$O$1),\"x\")","v":36},{"$f":"IFERROR(IF(H40+$O$1>$S$1,H40+$O$1-$S$1,H40+$O$1),\"x\")","v":45},{"$f":"IFERROR(IF(I40+$O$1>$S$1,I40+$O$1-$S$1,I40+$O$1),\"x\")","v":6}]
["x",{"$f":"IF(ROW(B41)-1<=$S$1,ROW(B41)-1,\"x\")","v":40},{"$f":"B41","v":40},{"$f":"IFERROR(IF(C41-$O$1<=0,$S$1-$O$1+C41,C41-$O$1),\"x\")","v":31},{"$f":"IFERROR(IF(D41-$O$1<=0,$S$1-$O$1+D41,D41-$O$1),\"x\")","v":22},{"$f":"IFERROR(IF(E41-$O$1<=0,$S$1-$O$1+E41,E41-$O$1),\"x\")","v":13},{"$f":"IFERROR(IF(F41-$O$1<=0,$S$1-$O$1+F41,F41-$O$1),\"x\")","v":4},{"$f":"IFERROR(IF(G41-$O$1<=0,$S$1-$O$1+G41,G41-$O$1),\"x\")","v":43},{"$f":"IFERROR(IF(H41-$O$1<=0,$S$1-$O$1+H41,H41-$O$1),\"x\")","v":34},{"$f":"IFERROR(IF(I41-$O$1<=0,$S$1-$O$1+I41,I41-$O$1),\"x\")","v":25}]
["x",{"$f":"IF(ROW(B42)-1<=$S$1,ROW(B42)-1,\"x\")","v":41},{"$f":"B42","v":41},{"$f":"IFERROR(IF(C42+$O$1>$S$1,C42+$O$1-$S$1,C42+$O$1),\"x\")","v":2},{"$f":"IFERROR(IF(D42+$O$1>$S$1,D42+$O$1-$S$1,D42+$O$1),\"x\")","v":11},{"$f":"IFERROR(IF(E42+$O$1>$S$1,E42+$O$1-$S$1,E42+$O$1),\"x\")","v":20},{"$f":"IFERROR(IF(F42+$O$1>$S$1,F42+$O$1-$S$1,F42+$O$1),\"x\")","v":29},{"$f":"IFERROR(IF(G42+$O$1>$S$1,G42+$O$1-$S$1,G42+$O$1),\"x\")","v":38},{"$f":"IFERROR(IF(H42+$O$1>$S$1,H42+$O$1-$S$1,H42+$O$1),\"x\")","v":47},{"$f":"IFERROR(IF(I42+$O$1>$S$1,I42+$O$1-$S$1,I42+$O$1),\"x\")","v":8}]
["x",{"$f":"IF(ROW(B43)-1<=$S$1,ROW(B43)-1,\"x\")","v":42},{"$f":"B43","v":42},{"$f":"IFERROR(IF(C43-$O$1<=0,$S$1-$O$1+C43,C43-$O$1),\"x\")","v":33},{"$f":"IFERROR(IF(D43-$O$1<=0,$S$1-$O$1+D43,D43-$O$1),\"x\")","v":24},{"$f":"IFERROR(IF(E43-$O$1<=0,$S$1-$O$1+E43,E43-$O$1),\"x\")","v":15},{"$f":"IFERROR(IF(F43-$O$1<=0,$S$1-$O$1+F43,F43-$O$1),\"x\")","v":6},{"$f":"IFERROR(IF(G43-$O$1<=0,$S$1-$O$1+G43,G43-$O$1),\"x\")","v":45},{"$f":"IFERROR(IF(H43-$O$1<=0,$S$1-$O$1+H43,H43-$O$1),\"x\")","v":36},{"$f":"IFERROR(IF(I43-$O$1<=0,$S$1-$O$1+I43,I43-$O$1),\"x\")","v":27}]
["x",{"$f":"IF(ROW(B44)-1<=$S$1,ROW(B44)-1,\"x\")","v":43},{"$f":"B44","v":43},{"$f":"IFERROR(IF(C44+$O$1>$S$1,C44+$O$1-$S$1,C44+$O$1),\"x\")","v":4},{"$f":"IFERROR(IF(D44+$O$1>$S$1,D44+$O$1-$S$1,D44+$O$1),\"x\")","v":13},{"$f":"IFERROR(IF(E44+$O$1>$S$1,E44+$O$1-$S$1,E44+$O$1),\"x\")","v":22},{"$f":"IFERROR(IF(F44+$O$1>$S$1,F44+$O$1-$S$1,F44+$O$1),\"x\")","v":31},{"$f":"IFERROR(IF(G44+$O$1>$S$1,G44+$O$1-$S$1,G44+$O$1),\"x\")","v":40},{"$f":"IFERROR(IF(H44+$O$1>$S$1,H44+$O$1-$S$1,H44+$O$1),\"x\")","v":1},{"$f":"IFERROR(IF(I44+$O$1>$S$1,I44+$O$1-$S$1,I44+$O$1),\"x\")","v":10}]
["x",{"$f":"IF(ROW(B45)-1<=$S$1,ROW(B45)-1,\"x\")","v":44},{"$f":"B45","v":44},{"$f":"IFERROR(IF(C45-$O$1<=0,$S$1-$O$1+C45,C45-$O$1),\"x\")","v":35},{"$f":"IFERROR(IF(D45-$O$1<=0,$S$1-$O$1+D45,D45-$O$1),\"x\")","v":26},{"$f":"IFERROR(IF(E45-$O$1<=0,$S$1-$O$1+E45,E45-$O$1),\"x\")","v":17},{"$f":"IFERROR(IF(F45-$O$1<=0,$S$1-$O$1+F45,F45-$O$1),\"x\")","v":8},{"$f":"IFERROR(IF(G45-$O$1<=0,$S$1-$O$1+G45,G45-$O$1),\"x\")","v":47},{"$f":"IFERROR(IF(H45-$O$1<=0,$S$1-$O$1+H45,H45-$O$1),\"x\")","v":38},{"$f":"IFERROR(IF(I45-$O$1<=0,$S$1-$O$1+I45,I45-$O$1),\"x\")","v":29}]
["x",{"$f":"IF(ROW(B46)-1<=$S$1,ROW(B46)-1,\"x\")","v":45},{"$f":"B46","v":45},{"$f":"IFERROR(IF(C46+$O$1>$S$1,C46+$O$1-$S$1,C46+$O$1),\"x\")","v":6},{"$f":"IFERROR(IF(D46+$O$1>$S$1,D46+$O$1-$S$1,D46+$O$1),\"x\")","v":15},{"$f":"IFERROR(IF(E46+$O$1>$S$1,E46+$O$1-$S$1,E46+$O$1),\"x\")","v":24},{"$f":"IFERROR(IF(F46+$O$1>$S$1,F46+$O$1-$S$1,F46+$O$1),\"x\")","v":33},{"$f":"IFERROR(IF(G46+$O$1>$S$1,G46+$O$1-$S$1,G46+$O$1),\"x\")","v":42},{"$f":"IFERROR(IF(H46+$O$1>$S$1,H46+$O$1-$S$1,H46+$O$1),\"x\")","v":3},{"$f":"IFERROR(IF(I46+$O$1>$S$1,I46+$O$1-$S$1,I46+$O$1),\"x\")","v":12}]
["x",{"$f":"IF(ROW(B47)-1<=$S$1,ROW(B47)-1,\"x\")","v":46},{"$f":"B47","v":46},{"$f":"IFERROR(IF(C47-$O$1<=0,$S$1-$O$1+C47,C47-$O$1),\"x\")","v":37},{"$f":"IFERROR(IF(D47-$O$1<=0,$S$1-$O$1+D47,D47-$O$1),\"x\")","v":28},{"$f":"IFERROR(IF(E47-$O$1<=0,$S$1-$O$1+E47,E47-$O$1),\"x\")","v":19},{"$f":"IFERROR(IF(F47-$O$1<=0,$S$1-$O$1+F47,F47-$O$1),\"x\")","v":10},{"$f":"IFERROR(IF(G47-$O$1<=0,$S$1-$O$1+G47,G47-$O$1),\"x\")","v":1},{"$f":"IFERROR(IF(H47-$O$1<=0,$S$1-$O$1+H47,H47-$O$1),\"x\")","v":40},{"$f":"IFERROR(IF(I47-$O$1<=0,$S$1-$O$1+I47,I47-$O$1),\"x\")","v":31}]
["x",{"$f":"IF(ROW(B48)-1<=$S$1,ROW(B48)-1,\"x\")","v":47},{"$f":"B48","v":47},{"$f":"IFERROR(IF(C48+$O$1>$S$1,C48+$O$1-$S$1,C48+$O$1),\"x\")","v":8},{"$f":"IFERROR(IF(D48+$O$1>$S$1,D48+$O$1-$S$1,D48+$O$1),\"x\")","v":17},{"$f":"IFERROR(IF(E48+$O$1>$S$1,E48+$O$1-$S$1,E48+$O$1),\"x\")","v":26},{"$f":"IFERROR(IF(F48+$O$1>$S$1,F48+$O$1-$S$1,F48+$O$1),\"x\")","v":35},{"$f":"IFERROR(IF(G48+$O$1>$S$1,G48+$O$1-$S$1,G48+$O$1),\"x\")","v":44},{"$f":"IFERROR(IF(H48+$O$1>$S$1,H48+$O$1-$S$1,H48+$O$1),\"x\")","v":5},{"$f":"IFERROR(IF(I48+$O$1>$S$1,I48+$O$1-$S$1,I48+$O$1),\"x\")","v":14}]
["x",{"$f":"IF(ROW(B49)-1<=$S$1,ROW(B49)-1,\"x\")","v":48},{"$f":"B49","v":48},{"$f":"IFERROR(IF(C49-$O$1<=0,$S$1-$O$1+C49,C49-$O$1),\"x\")","v":39},{"$f":"IFERROR(IF(D49-$O$1<=0,$S$1-$O$1+D49,D49-$O$1),\"x\")","v":30},{"$f":"IFERROR(IF(E49-$O$1<=0,$S$1-$O$1+E49,E49-$O$1),\"x\")","v":21},{"$f":"IFERROR(IF(F49-$O$1<=0,$S$1-$O$1+F49,F49-$O$1),\"x\")","v":12},{"$f":"IFERROR(IF(G49-$O$1<=0,$S$1-$O$1+G49,G49-$O$1),\"x\")","v":3},{"$f":"IFERROR(IF(H49-$O$1<=0,$S$1-$O$1+H49,H49-$O$1),\"x\")","v":42},{"$f":"IFERROR(IF(I49-$O$1<=0,$S$1-$O$1+I49,I49-$O$1),\"x\")","v":33}]
["x",{"$f":"IF(ROW(B50)-1<=$S$1,ROW(B50)-1,\"x\")","v":"x"},{"$f":"B50","v":"x"},{"$f":"IFERROR(IF(C50+$O$1>$S$1,C50+$O$1-$S$1,C50+$O$1),\"x\")","v":"x"},{"$f":"IFERROR(IF(D50+$O$1>$S$1,D50+$O$1-$S$1,D50+$O$1),\"x\")","v":"x"},{"$f":"IFERROR(IF(E50+$O$1>$S$1,E50+$O$1-$S$1,E50+$O$1),\"x\")","v":"x"},{"$f":"IFERROR(IF(F50+$O$1>$S$1,F50+$O$1-$S$1,F50+$O$1),\"x\")","v":"x"},{"$f":"IFERROR(IF(G50+$O$1>$S$1,G50+$O$1-$S$1,G50+$O$1),\"x\")","v":"x"},{"$f":"IFERROR(IF(H50+$O$1>$S$1,H50+$O$1-$S$1,H50+$O$1),\"x\")","v":"x"},{"$f":"IFERROR(IF(I50+$O$1>$S$1,I50+$O$1-$S$1,I50+$O$1),\"x\")","v":"x"}]
["x",{"$f":"IF(ROW(B51)-1<=$S$1,ROW(B51)-1,\"x\")","v":"x"},{"$f":"B51","v":"x"},{"$f":"IFERROR(IF(C51-$O$1<=0,$S$1-$O$1+C51,C51-$O$1),\"x\")","v":"x"},{"$f":"IFERROR(IF(D51-$O$1<=0,$S$1-$O$1+D51,D51-$O$1),\"x\")","v":"x"},{"$f":"IFERROR(IF(E51-$O$1<=0,$S$1-$O$1+E51,E51-$O$1),\"x\")","v":"x"},{"$f":"IFERROR(IF(F51-$O$1<=0,$S$1-$O$1+F51,F51-$O$1),\"x\")","v":"x"},{"$f":"IFERROR(IF(G51-$O$1<=0,$S$1-$O$1+G51,G51-$O$1),\"x\")","v":"x"},{"$f":"IFERROR(IF(H51-$O$1<=0,$S$1-$O$1+H51,H51-$O$1),\"x\")","v":"x"},{"$f":"IFERROR(IF(I51-$O$1<=0,$S$1-$O$1+I51,I51-$O$1),\"x\")","v":"x"}]

{"sheet":"rozhozeni","index":1,"n_rows":39,"n_cols":16,"rows_kept":39,"cut":false,"hidden":true,"merged":[]}
["Stanoviště","kolo1","Stanoviště","kolo2","Stanoviště","kolo3","Stanoviště","kolo4","Stanoviště","kolo5","Stanoviště","kolo6","Stanoviště","kolo7","Stanoviště","kolo8"]
[1,1,9,3,17,5,25,7,33,9,3,11,11,13,19,15]
[2,2,10,38,18,36,26,34,34,32,4,30,12,28,20,26]
[3,3,11,5,19,7,27,9,35,11,5,13,13,15,21,17]
[4,4,12,2,20,38,28,36,36,34,6,32,14,30,22,28]
[5,5,13,7,21,9,29,11,37,13,7,15,15,17,23,19]
[6,6,14,4,22,2,30,38,38,36,8,34,16,32,24,30]
[7,7,15,9,23,11,31,13,1,15,9,17,17,19,25,21]
[8,8,16,6,24,4,32,2,2,38,10,36,18,34,26,32]
[9,9,17,11,25,13,33,15,3,17,11,19,19,21,27,23]
[10,10,18,8,26,6,34,4,4,2,12,38,20,36,28,34]
[11,11,19,13,27,15,35,17,5,19,13,21,21,23,29,25]
[12,12,20,10,28,8,36,6,6,4,14,2,22,38,30,36]
[13,13,21,15,29,17,37,19,7,21,15,23,23,25,31,27]
[14,14,22,12,30,10,38,8,8,6,16,4,24,2,32,38]
[15,15,23,17,31,19,1,21,9,23,17,25,25,27,33,29]
[16,16,24,14,32,12,2,10,10,8,18,6,26,4,34,2]
[17,17,25,19,33,21,3,23,11,25,19,27,27,29,35,31]
[18,18,26,16,34,14,4,12,12,10,20,8,28,6,36,4]
[19,19,27,21,35,23,5,25,13,27,21,29,29,31,37,33]
[20,20,28,18,36,16,6,14,14,12,22,10,30,8,38,6]
[21,21,29,23,37,25,7,27,15,29,23,31,31,33,1,35]
[22,22,30,20,38,18,8,16,16,14,24,12,32,10,2,8]
[23,23,31,25,1,27,9,29,17,31,25,33,33,35,3,37]
[24,24,32,22,2,20,10,18,18,16,26,14,34,12,4,10]
[25,25,33,27,3,29,11,31,19,33,27,35,35,37,5,1]
[26,26,34,24,4,22,12,20,20,18,28,16,36,14,6,12]
[27,27,35,29,5,31,13,33,21,35,29,37,37,1,7,3]
[28,28,36,26,6,24,14,22,22,20,30,18,38,16,8,14]
[29,29,37,31,7,33,15,35,23,37,31,1,1,3,9,5]
[30,30,38,28,8,26,16,24,24,22,32,20,2,18,10,16]
[31,31,1,33,9,35,17,37,25,1,33,3,3,5,11,7]
[32,32,2,30,10,28,18,26,26,24,34,22,4,20,12,18]
[33,33,3,35,11,37,19,1,27,3,35,5,5,7,13,9]
[34,34,4,32,12,30,20,28,28,26,36,24,6,22,14,20]
[35,35,5,37,13,1,21,3,29,5,37,7,7,9,15,11]
[36,36,6,34,14,32,22,30,30,28,38,26,8,24,16,22]
[37,37,7,1,15,3,23,5,31,7,1,9,9,11,17,13]
[38,38,8,36,16,34,24,32,32,30,2,28,10,26,18,24]

{"sheet":"varianty","index":2,"n_rows":86,"n_cols":2,"rows_kept":86,"cut":false,"hidden":true,"merged":[]}
["závodníků","posun"]
[30,2]
[30,3]
[30,4]
[30,8]
[30,9]
[31,2]
[31,6]
[31,10]
[32,2]
[32,6]
[32,10]
[33,2]
[34,2]
[34,3]
[34,4]
[34,6]
[34,8]
[34,9]
[34,10]
[35,2]
[35,4]
[35,8]
[35,10]
[36,2]
[36,4]
[36,8]
[36,10]
[37,2]
[38,2]
[38,4]
[38,5]
[38,6]
[38,8]
[38,9]
[38,10]
[39,2]
[39,6]
[40,2]
[40,6]
[41,2]
[41,8]
[42,2]
[42,3]
[42,4]
[42,5]
[42,8]
[42,9]
[42,10]
[43,2]
[43,4]
[43,6]
[43,8]
[43,10]
[44,2]
[44,3]
[44,4]
[44,6]
[44,7]
[44,8]
[44,10]
[45,2]
[46,2]
[46,3]
[46,4]
[46,5]
[46,6]
[46,7]
[46,8]
[46,9]
[46,10]
[47,2]
[47,10]
[48,2]
[48,3]
[48,9]
[48,10]
[49,2]
[50,2]
[50,3]
[50,4]
[50,5]
[50,6]
[50,7]
[50,8]
[50,9]

{"sheet":"Hárok9","index":3,"n_rows":52,"n_cols":15,"rows_kept":52,"cut":false,"hidden":false,"merged":[]}
[0,null,null,"Počet bodov"]
["Pretekár","Poradie","Meno",1,2,3,4,5,6,7,8,"počet bodov celkovo","počet rýb","počet výhier 3 b","počet remíz 1,5b"]
[10,1,"Mešenec Martin",3,3,3,3,3,3,0,3,21,35,7,0]
[45,2,"Drahoš Matúš",3,0,3,3,3,3,3,3,21,33,7,0]
[3,3,"Kemencik Zoltán",3,3,3,3,1,3,0,3,19,23,6,0]
[14,4,"Petráš Martin",3,3,3,3,3,0,0,3,18,27,6,0]
[18,5,"Mašan Tomáš",3,0,3,3,3,0,3,3,18,27,6,0]
[1,6,"Pecník Branislav",3,3,3,3,0,0,3,1,16,25,5,0]
[32,7,"Belovič Radoslav",3,3,3,3,0,3,1,0,16,23,5,0]
[38,8,"Šenigla Vladimír",3,3,0,3,3,0,3,1,16,18,5,0]
[27,9,"Schwarcz Roman",3,3,3,0,3,0,3,1,16,16,5,0]
[23,10,"Michalka Marián",3,3,3,1.5,3,1.5,0,1,16,24,4,2]
[22,11,"Pavlíček Ľuboš",3,3,0,3,0,3,1,1.5,14.5,24,4,1]
[36,12,"Daněk Michal",0,3,3,1.5,3,0,3,1,14.5,22,4,1]
[42,13,"Borovica Jozef",0,3,0,3,3,3,1,1,14,22,4,0]
[30,14,"Vančík Juraj",3,3,3,0,0,1,3,1,14,14,4,0]
[16,15,"Sýkora Jozef",3,3,0,3,0,1.5,3,0,13.5,30,4,1]
[5,16,"Brezničan Martin",3,1.5,3,0,3,3,0,0,13.5,23,4,1]
[7,17,"Ilsur Talipov",3,1.5,3,0,3,0,1.5,1,13,25,3,2]
[28,18,"Zubák Peter",0,3,3,1.5,1,0,1,3,12.5,12,3,1]
[35,19,"Hrivňák Ivan",3,0,0,0,3,3,0,3,12,26,4,0]
[8,20,"Mičo Martin",0,3,1.5,0,3,0,3,1,11.5,39,3,1]
[11,21,"Šenigla Peter",3,0,3,0,0,1.5,3,1,11.5,27,3,1]
[34,22,"Smorada Marek",0,3,0,3,0,1.5,1,3,11.5,17,3,1]
[26,23,"Jarka Pavel",3,3,0,1.5,3,0,1,0,11.5,16,3,1]
[6,24,"Kochan Ladislav",0,1,0,0,3,3,3,1.5,11.5,11,3,1]
[9,25,"Florek Tomáš",0,0,3,0,3,3,1,1,11,12,3,0]
[19,26,"Popovič Milan",0,0,1.5,1.5,3,3,1,1,11,17,2,2]
[43,27,"Petríček Jaroslav",0,3,0,3,1.5,3,0,0,10.5,23,3,1]
[25,28,"Slávik Igor",0,0,0,3,3,3,0,1.5,10.5,18,3,1]
[20,29,"Slávik Michal",3,0,1.5,0,1.5,3,1.5,0,10.5,19,2,3]
[48,30,"Melicháč Matej",3,0,0,0,0,3,3,1,10,21,3,0]
[39,31,"Hornák Filip",0,0,0,3,3,0,1,3,10,13,3,0]
[33,32,"Novotný Jozef",3,0,3,0,0,3,1,0,10,11,3,0]
[31,33,"Smorada Ján",0,3,1.5,1.5,0,3,1,0,10,13,2,2]
[4,34,"Petríček Stanislav",0,3,3,0,0,1.5,1,1,9.5,19,2,1]
[12,35,"Potoček Ján",0,0,0,3,0,0,3,3,9,26,3,0]
[41,36,"Kuhajda Rastislav",3,0,0,3,0,1.5,0,1.5,9,12,2,2]
[15,37,"Pisarovič Erik",0,0,0,3,1,3,1,0,8,20,2,0]
[40,38,"Drgon Martin",3,0,0,3,1,0,0,1,8,14,2,0]
[37,39,"Révay Dušan",0,1,3,0,0,1,3,0,8,11,2,0]
[44,40,"Mádr Tomáš",3,0,0,0,0,0,1,3,7,9,2,0]
[21,41,"Šintál Adam",0,0,0,1.5,0,3,1,1,6.5,14,1,1]
[46,42,"Zrubec Róbert",0,1.5,0,0,3,0,1,1,6.5,12,1,1]
[47,43,"Kriho Marián",0,0,0,3,0,3,0,0,6,17,2,0]
[17,44,"Krnčan Juraj",0,0,3,1.5,0,0,0,1,5.5,18,1,1]
[2,45,"Buršák Roman",0,3,1.5,0,0,0,0,1,5.5,12,1,1]
[13,46,"Maráček Peter",0,0,1.5,0,0,0,1,1,3.5,7,0,1]
[29,47,"Masarech Michal",0,1.5,0,0,0,0,1,0,2.5,6,0,1]
[24,48,null,0,0,0,0,0,0,0,0,0,0,0,0]
[49,null,"x",0,0,0,0,0,0,0,0,0,0,0,0]
[50,null,"x",0,0,0,0,0,0,0,0,0,0,0,0]