{"text_format":"1","workbook":"xlsx","n_sheets":7,"sheets":["RYBARI","seznam","ZREBOVANIE","TABULKA","SÚBOJE","BODY","varianty"],"not_rendered":{"charts":0,"images":0,"macros":1,"external_links":0,"defined_names":2,"comments":0,"pivot_tables":0},"unopened":[],"bounds":{"document_bytes":16777216,"sheet_cells":100000,"rows_first":2000,"rows_last":500,"rows_between":2000,"halvings":0,"cell_chars":16384,"cell_head_chars":4096},"cells_cut":0,"cells_raw":0,"read":"whole","date_system":"1900"}

{"sheet":"RYBARI","index":0,"n_rows":51,"n_cols":11,"rows_kept":51,"cut":false,"hidden":false,"merged":[]}
["číslo","nč","Meno","kolo1","kolo2","kolo3","kolo4","kolo5","kolo6","kolo7","kolo8"]
[1,{"$f":"RAND()","v":0.51709331553754756},"Šenigla Peter",1,39,29,19,9,47,37,27]
[2,{"$f":"RAND()","v":0.89300716345555697},"Masarech Michal",2,12,22,32,42,4,14,24]
[3,0.93761017292487769,"Mešenec Martin",3,41,31,21,11,1,39,29]
[4,0.80921661999648531,"Drančák David",4,14,24,34,44,6,16,26]
[5,0.7166484368000936,"Vančík Juraj",5,43,33,23,13,3,41,31]
[6,0.74803709908065041,"Mašan Tomáš",6,16,26,36,46,8,18,28]
[7,9.1649265030642635E-2,"Daněk Michal",7,45,35,25,15,5,43,33]
[8,0.54656398909136328,"Kochan Ladislav",8,18,28,38,48,10,20,30]
[9,9.9587102383469572E-2,"Spáčil Matej",9,47,37,27,17,7,45,35]
[10,0.47784161809657266,"Kollár Mikuláš",10,20,30,40,2,12,22,32]
[11,0.54202843095093178,"Kuhajda Rastislav",11,1,39,29,19,9,47,37]
[12,0.29449702166144354,"Šintál Adam",12,22,32,42,4,14,24,34]
[13,0.51567442160481758,"Kemencik Zoltán",13,3,41,31,21,11,1,39]
[14,5.7972757946676001E-2,"Buršák Roman",14,24,34,44,6,16,26,36]
[15,0.93797114611239052,"Jarka Pavel",15,5,43,33,23,13,3,41]
[16,0.2836422144498032,"Kriho Marián",16,26,36,46,8,18,28,38]
[17,0.19437641327195998,"Onofrej Ivan",17,7,45,35,25,15,5,43]
[18,0.73778869915896694,"Smorada Marek",18,28,38,48,10,20,30,40]
[19,0.8534476628783938,"Hornák Filip",19,9,47,37,27,17,7,45]
[20,0.33983702633235735,"Mičo Martin",20,30,40,2,12,22,32,42]
[21,0.58934277064896512,"Medo Marián",21,11,1,39,29,19,9,47]
[22,0.19939132586147468,"Belovič Radoslav",22,32,42,4,14,24,34,44]
[23,0.3968283536610151,"Beňo Gabriel",23,13,3,41,31,21,11,1]
[24,0.75553222255611563,"Pecník Branislav",24,34,44,6,16,26,36,46]
[25,0.62006614547099081,"Drahoš Matúš",25,15,5,43,33,23,13,3]
[26,0.31167548578592674,"Krnčan Juraj",26,36,46,8,18,28,38,48]
[27,0.46196095532848391,"Mrázik Juraj",27,17,7,45,35,25,15,5]
[28,0.34663353042269252,"Šenigla Vladimír",28,38,48,10,20,30,40,2]
[29,0.22958522409009263,"Révay Dušan",29,19,9,47,37,27,17,7]
[30,0.62863166069407739,"Borovica Jozef",30,40,2,12,22,32,42,4]
[31,0.43589878919135217,"Sýkora Jozef",31,21,11,1,39,29,19,9]
[32,0.76442112620431679,"Zrubec Róbert",32,42,4,14,24,34,44,6]
[33,0.70643271683171449,"Florek Tomáš",33,23,13,3,41,31,21,11]
[34,0.94831384847486766,"Pavlíček Ľuboš",34,44,6,16,26,36,46,8]
[35,0.29657641592687878,"Petráš Martin",35,25,15,5,43,33,23,13]
[36,0.3757472632126434,"Hrivňák Ivan",36,46,8,18,28,38,48,10]
[37,0.61612557186728689,"Mádr Tomáš",37,27,17,7,45,35,25,15]
[38,0.66461212063025332,"Slávik Igor",38,48,10,20,30,40,2,12]
[39,0.16130949455154453,"Petríček Stanislav",39,29,19,9,47,37,27,17]
[40,0.86773243008595946,"Smorada Ján",40,2,12,22,32,42,4,14]
[41,0.37375188350204924,"Schwarcz Roman",41,31,21,11,1,39,29,19]
[42,0.20138619564946458,"Petríček Jaroslav",42,4,14,24,34,44,6,16]
[43,0.11732070140759554,"Michalka Marián",43,33,23,13,3,41,31,21]
[44,8.7132218892751023E-2,"Pisarovič Erik",44,6,16,26,36,46,8,18]
[45,0.554023822051816,"Popovič Milan",45,35,25,15,5,43,33,23]
[46,0.95309835165480161,"Slávik Michal",46,8,18,28,38,48,10,20]
[47,0.47982842818017779,"Medo Peter",47,37,27,17,7,45,35,25]
[48,0.79426931599597472]
[49,0.73152508512796111]
[50,0.34119811214959683]

{"sheet":"seznam","index":1,"n_rows":51,"n_cols":1,"rows_kept":51,"cut":false,"hidden":true,"merged":[]}
["-"]
["Belovič Radoslav"]
["Beňo Gabriel"]
["Borovica Jozef"]
["Buršák Roman"]
["Daněk Michal"]
["Drahoš Matúš"]
["Drančák David"]
["Drgoň Martin"]
["Florek Tomáš"]
["Hornák Filip"]
["Hrivňák Ivan"]
["Jarka Pavel"]
["Kemencik Zoltán"]
["Kochan Ladislav"]
["Kollár Mikuláš"]
["Kriho Marián"]
["Krnčan Juraj"]
["Kuhajda Rastislav"]
["Mádr Tomáš"]
["Masarech Michal"]
["Maslaňák Marián"]
["Mašan Tomáš"]
["Medo Marián"]
["Medo Peter"]
["Mešenec Martin"]
["Mičo Martin"]
["Michalka Marián"]
["Mrázik Juraj"]
["Onofrej Ivan"]
["Patrnčiak Dušan"]
["Pavlíček Ľuboš"]
["Pecník Branislav"]
["Petráš Martin"]
["Petríček Jaroslav"]
["Petríček Stanislav"]
["Pisarovič Erik"]
["Popovič Milan"]
["Révay Dušan"]
["Schwarcz Roman"]
["Slávik Igor"]
["Slávik Michal"]
["Smorada Ján"]
["Smorada Marek"]
["Spáčil Matej"]
["Sýkora Jozef"]
["Šenigla Peter"]
["Šenigla Vladimír"]
["Šintál Adam"]
["Vančík Juraj"]
["Zrubec Róbert"]

{"sheet":"ZREBOVANIE","index":2,"n_rows":51,"n_cols":21,"rows_kept":51,"cut":false,"hidden":false,"merged":[]}
["S/L","Stanoviště","kolo1","kolo2","kolo3","kolo4","kolo5","kolo6","kolo7","kolo8",null,"počet pretekárov",47,"POSUN",10,null,null,"zavodnikuVzorec",{"$f":"IF(MOD($M$1,2)=0,$M$1,$M$1+1)","v":48},"lichý",{"$f":"MOD(M1,2)","v":1}]
[{"$f":"MOD(B2,2)","v":1},1,{"$f":"B2","v":1},{"$f":"IF(C2+$O$1>$S$1,C2+$O$1-$S$1,C2+$O$1)","v":11},21,31,41,3,13,23]
[{"$f":"MOD(B3,2)","v":0},2,{"$f":"B3","v":2},{"$f":"IF(C3-$O$1<=0,$S$1-$O$1+C3,C3-$O$1)","v":40},30,20,10,48,38,28]
[1,3,3,{"$f":"IF(C4+$O$1>$S$1,C4+$O$1-$S$1,C4+$O$1)","v":13},23,33,43,5,15,25]
[0,4,4,{"$f":"IF(C5-$O$1<=0,$S$1-$O$1+C5,C5-$O$1)","v":42},32,22,12,2,40,30]
[1,5,5,{"$f":"IF(C6+$O$1>$S$1,C6+$O$1-$S$1,C6+$O$1)","v":15},25,35,45,7,17,27]
[0,6,6,{"$f":"IF(C7-$O$1<=0,$S$1-$O$1+C7,C7-$O$1)","v":44},34,24,14,4,42,32]
[1,7,7,{"$f":"IF(C8+$O$1>$S$1,C8+$O$1-$S$1,C8+$O$1)","v":17},27,37,47,9,19,29]
[0,8,8,{"$f":"IF(C9-$O$1<=0,$S$1-$O$1+C9,C9-$O$1)","v":46},36,26,16,6,44,34]
[1,9,9,{"$f":"IF(C10+$O$1>$S$1,C10+$O$1-$S$1,C10+$O$1)","v":19},29,39,1,11,21,31]
[0,10,10,{"$f":"IF(C11-$O$1<=0,$S$1-$O$1+C11,C11-$O$1)","v":48},38,28,18,8,46,36]
[1,11,11,{"$f":"IF(C12+$O$1>$S$1,C12+$O$1-$S$1,C12+$O$1)","v":21},31,41,3,13,23,33]
[0,12,12,{"$f":"IF(C13-$O$1<=0,$S$1-$O$1+C13,C13-$O$1)","v":2},40,30,20,10,48,38]
[1,13,13,{"$f":"IF(C14+$O$1>$S$1,C14+$O$1-$S$1,C14+$O$1)","v":23},33,43,5,15,25,35]
[0,14,14,{"$f":"IF(C15-$O$1<=0,$S$1-$O$1+C15,C15-$O$1)","v":4},42,32,22,12,2,40]
[1,15,15,{"$f":"IF(C16+$O$1>$S$1,C16+$O$1-$S$1,C16+$O$1)","v":25},35,45,7,17,27,37]
[0,16,16,{"$f":"IF(C17-$O$1<=0,$S$1-$O$1+C17,C17-$O$1)","v":6},44,34,24,14,4,42]
[1,17,17,{"$f":"IF(C18+$O$1>$S$1,C18+$O$1-$S$1,C18+$O$1)","v":27},37,47,9,19,29,39]
[0,18,18,{"$f":"IF(C19-$O$1<=0,$S$1-$O$1+C19,C19-$O$1)","v":8},46,36,26,16,6,44]
[1,19,19,{"$f":"IF(C20+$O$1>$S$1,C20+$O$1-$S$1,C20+$O$1)","v":29},39,1,11,21,31,41]
[0,20,20,{"$f":"IF(C21-$O$1<=0,$S$1-$O$1+C21,C21-$O$1)","v":10},48,38,28,18,8,46]
[1,21,21,{"$f":"IF(C22+$O$1>$S$1,C22+$O$1-$S$1,C22+$O$1)","v":31},41,3,13,23,33,43]
[0,22,22,{"$f":"IF(C23-$O$1<=0,$S$1-$O$1+C23,C23-$O$1)","v":12},2,40,30,20,10,48]
[1,23,23,{"$f":"IF(C24+$O$1>$S$1,C24+$O$1-$S$1,C24+$O$1)","v":33},43,5,15,25,35,45]
[0,24,24,{"$f":"IF(C25-$O$1<=0,$S$1-$O$1+C25,C25-$O$1)","v":14},4,42,32,22,12,2]
[1,25,25,{"$f":"IF(C26+$O$1>$S$1,C26+$O$1-$S$1,C26+$O$1)","v":35},45,7,17,27,37,47]
[0,26,26,{"$f":"IF(C27-$O$1<=0,$S$1-$O$1+C27,C27-$O$1)","v":16},6,44,34,24,14,4]
[1,27,27,{"$f":"IF(C28+$O$1>$S$1,C28+$O$1-$S$1,C28+$O$1)","v":37},47,9,19,29,39,1]
[0,28,28,{"$f":"IF(C29-$O$1<=0,$S$1-$O$1+C29,C29-$O$1)","v":18},8,46,36,26,16,6]
[1,29,29,{"$f":"IF(C30+$O$1>$S$1,C30+$O$1-$S$1,C30+$O$1)","v":39},1,11,21,31,41,3]
["x",30,30,{"$f":"IF(C31-$O$1<=0,$S$1-$O$1+C31,C31-$O$1)","v":20},10,48,38,28,18,8]
["x",{"$f":"IF(ROW(B32)-1<=$S$1,ROW(B32)-1,\"x\")","v":31},31,{"$f":"IFERROR(IF(C32+$O$1>$S$1,C32+$O$1-$S$1,C32+$O$1),\"x\")","v":41},3,13,23,33,43,5]
["x",32,32,{"$f":"IFERROR(IF(C33-$O$1<=0,$S$1-$O$1+C33,C33-$O$1),\"x\")","v":22},12,2,40,30,20,10]
["x",33,33,{"$f":"IFERROR(IF(C34+$O$1>$S$1,C34+$O$1-$S$1,C34+$O$1),\"x\")","v":43},5,15,25,35,45,7]
["x",34,34,{"$f":"IFERROR(IF(C35-$O$1<=0,$S$1-$O$1+C35,C35-$O$1),\"x\")","v":24},14,4,42,32,22,12]
["x",35,35,{"$f":"IFERROR(IF(C36+$O$1>$S$1,C36+$O$1-$S$1,C36+$O$1),\"x\")","v":45},7,17,27,37,47,9]
["x",36,36,{"$f":"IFERROR(IF(C37-$O$1<=0,$S$1-$O$1+C37,C37-$O$1),\"x\")","v":26},16,6,44,34,24,14]
["x",37,37,{"$f":"IFERROR(IF(C38+$O$1>$S$1,C38+$O$1-$S$1,C38+$O$1),\"x\")","v":47},9,19,29,39,1,11]
["x",38,38,{"$f":"IFERROR(IF(C39-$O$1<=0,$S$1-$O$1+C39,C39-$O$1),\"x\")","v":28},18,8,46,36,26,16]
["x",39,39,{"$f":"IFERROR(IF(C40+$O$1>$S$1,C40+$O$1-$S$1,C40+$O$1),\"x\")","v":1},11,21,31,41,3,13]
["x",40,40,{"$f":"IFERROR(IF(C41-$O$1<=0,$S$1-$O$1+C41,C41-$O$1),\"x\")","v":30},20,10,48,38,28,18]
["x",41,41,{"$f":"IFERROR(IF(C42+$O$1>$S$1,C42+$O$1-$S$1,C42+$O$1),\"x\")","v":3},13,23,33,43,5,15]
["x",42,42,{"$f":"IFERROR(IF(C43-$O$1<=0,$S$1-$O$1+C43,C43-$O$1),\"x\")","v":32},22,12,2,40,30,20]
["x",43,43,{"$f":"IFERROR(IF(C44+$O$1>$S$1,C44+$O$1-$S$1,C44+$O$1),\"x\")","v":5},15,25,35,45,7,17]
["x",44,44,{"$f":"IFERROR(IF(C45-$O$1<=0,$S$1-$O$1+C45,C45-$O$1),\"x\")","v":34},24,14,4,42,32,22]
["x",45,45,{"$f":"IFERROR(IF(C46+$O$1>$S$1,C46+$O$1-$S$1,C46+$O$1),\"x\")","v":7},17,27,37,47,9,19]
["x",46,46,{"$f":"IFERROR(IF(C47-$O$1<=0,$S$1-$O$1+C47,C47-$O$1),\"x\")","v":36},26,16,6,44,34,24]
["x",47,47,{"$f":"IFERROR(IF(C48+$O$1>$S$1,C48+$O$1-$S$1,C48+$O$1),\"x\")","v":9},19,29,39,1,11,21]
["x",48,48,{"$f":"IFERROR(IF(C49-$O$1<=0,$S$1-$O$1+C49,C49-$O$1),\"x\")","v":38},28,18,8,46,36,26]
["x","x","x",{"$f":"IFERROR(IF(C50+$O$1>$S$1,C50+$O$1-$S$1,C50+$O$1),\"x\")","v":"x"},"x","x","x","x","x","x"]
["x","x","x",{"$f":"IFERROR(IF(C51-$O$1<=0,$S$1-$O$1+C51,C51-$O$1),\"x\")","v":"x"},"x","x","x","x","x","x"]

{"sheet":"TABULKA","index":3,"n_rows":52,"n_cols":14,"rows_kept":52,"cut":false,"hidden":false,"merged":[[0,2,0,9]]}
[null,null,"Počet rýb"]
["Pretekár","Meno",1,2,3,4,5,6,7,8,null,null,null,{"$f":"ZREBOVANIE!$M$1","v":47}]
[1,{"$f":"IF(A3<=ZREBOVANIE!$M$1,VLOOKUP(A3,RYBARI!A:C,3,0),\"x\")","v":"Šenigla Peter"},4,1,3,2,5,3,2,1,{"$f":"SUM(C3:J3)","v":21}]
[2,{"$f":"IF(A4<=ZREBOVANIE!$M$1,VLOOKUP(A4,RYBARI!A:C,3,0),\"x\")","v":"Masarech Michal"},0,0,1,1,2,1,2,0,{"$f":"SUM(C4:J4)","v":7}]
[3,{"$f":"IF(A5<=ZREBOVANIE!$M$1,VLOOKUP(A5,RYBARI!A:C,3,0),\"x\")","v":"Mešenec Martin"},1,4,2,1,4,3,2,1,18]
[4,{"$f":"IF(A6<=ZREBOVANIE!$M$1,VLOOKUP(A6,RYBARI!A:C,3,0),\"x\")","v":"Drančák David"},1,2,4,0,5,2,5,1,20]
[5,{"$f":"IF(A7<=ZREBOVANIE!$M$1,VLOOKUP(A7,RYBARI!A:C,3,0),\"x\")","v":"Vančík Juraj"},0,2,0,1,2,0,2,2,9]
[6,{"$f":"IF(A8<=ZREBOVANIE!$M$1,VLOOKUP(A8,RYBARI!A:C,3,0),\"x\")","v":"Mašan Tomáš"},2,3,4,2,4,3,2,2,22]
[7,{"$f":"IF(A9<=ZREBOVANIE!$M$1,VLOOKUP(A9,RYBARI!A:C,3,0),\"x\")","v":"Daněk Michal"},2,3,0,6,6,3,5,1,26]
[8,{"$f":"IF(A10<=ZREBOVANIE!$M$1,VLOOKUP(A10,RYBARI!A:C,3,0),\"x\")","v":"Kochan Ladislav"},3,0,0,1,2,0,2,3,11]
[9,{"$f":"IF(A11<=ZREBOVANIE!$M$1,VLOOKUP(A11,RYBARI!A:C,3,0),\"x\")","v":"Spáčil Matej"},2,5,0,0,3,2,3,1,16]
[10,{"$f":"IF(A12<=ZREBOVANIE!$M$1,VLOOKUP(A12,RYBARI!A:C,3,0),\"x\")","v":"Kollár Mikuláš"},5,1,2,2,1,0,3,0,14]
[11,{"$f":"IF(A13<=ZREBOVANIE!$M$1,VLOOKUP(A13,RYBARI!A:C,3,0),\"x\")","v":"Kuhajda Rastislav"},4,2,3,1,2,1,1,0,14]
[12,{"$f":"IF(A14<=ZREBOVANIE!$M$1,VLOOKUP(A14,RYBARI!A:C,3,0),\"x\")","v":"Šintál Adam"},4,3,2,1,5,1,1,0,17]
[13,{"$f":"IF(A15<=ZREBOVANIE!$M$1,VLOOKUP(A15,RYBARI!A:C,3,0),\"x\")","v":"Kemencik Zoltán"},1,1,3,0,1,1,2,2,11]
[14,{"$f":"IF(A16<=ZREBOVANIE!$M$1,VLOOKUP(A16,RYBARI!A:C,3,0),\"x\")","v":"Buršák Roman"},3,3,4,1,1,4,1,1,18]
[15,{"$f":"IF(A17<=ZREBOVANIE!$M$1,VLOOKUP(A17,RYBARI!A:C,3,0),\"x\")","v":"Jarka Pavel"},2,2,3,3,1,1,1,2,15]
[16,{"$f":"IF(A18<=ZREBOVANIE!$M$1,VLOOKUP(A18,RYBARI!A:C,3,0),\"x\")","v":"Kriho Marián"},5,4,4,3,2,2,2,2,24]
[17,{"$f":"IF(A19<=ZREBOVANIE!$M$1,VLOOKUP(A19,RYBARI!A:C,3,0),\"x\")","v":"Onofrej Ivan"},1,0,2,1,1,2,5,2,14]
[18,{"$f":"IF(A20<=ZREBOVANIE!$M$1,VLOOKUP(A20,RYBARI!A:C,3,0),\"x\")","v":"Smorada Marek"},2,2,4,3,3,4,1,2,21]
[19,{"$f":"IF(A21<=ZREBOVANIE!$M$1,VLOOKUP(A21,RYBARI!A:C,3,0),\"x\")","v":"Hornák Filip"},2,1,0,1,1,0,0,0,5]
[20,{"$f":"IF(A22<=ZREBOVANIE!$M$1,VLOOKUP(A22,RYBARI!A:C,3,0),\"x\")","v":"Mičo Martin"},5,5,5,1,2,4,2,0,24]
[21,{"$f":"IF(A23<=ZREBOVANIE!$M$1,VLOOKUP(A23,RYBARI!A:C,3,0),\"x\")","v":"Medo Marián"},5,0,0,1,1,1,1,1,10]
[22,{"$f":"IF(A24<=ZREBOVANIE!$M$1,VLOOKUP(A24,RYBARI!A:C,3,0),\"x\")","v":"Belovič Radoslav"},9,3,6,1,2,2,2,9,34]
[23,{"$f":"IF(A25<=ZREBOVANIE!$M$1,VLOOKUP(A25,RYBARI!A:C,3,0),\"x\")","v":"Beňo Gabriel"},3,1,1,0,1,0,4,5,15]
[24,{"$f":"IF(A26<=ZREBOVANIE!$M$1,VLOOKUP(A26,RYBARI!A:C,3,0),\"x\")","v":"Pecník Branislav"},4,5,2,1,3,1,1,2,19]
[25,{"$f":"IF(A27<=ZREBOVANIE!$M$1,VLOOKUP(A27,RYBARI!A:C,3,0),\"x\")","v":"Drahoš Matúš"},2,3,1,5,0,4,1,1,17]
[26,{"$f":"IF(A28<=ZREBOVANIE!$M$1,VLOOKUP(A28,RYBARI!A:C,3,0),\"x\")","v":"Krnčan Juraj"},3,3,4,1,2,2,1,2,18]
[27,{"$f":"IF(A29<=ZREBOVANIE!$M$1,VLOOKUP(A29,RYBARI!A:C,3,0),\"x\")","v":"Mrázik Juraj"},1,0,0,2,0,1,1,0,5]
[28,{"$f":"IF(A30<=ZREBOVANIE!$M$1,VLOOKUP(A30,RYBARI!A:C,3,0),\"x\")","v":"Šenigla Vladimír"},2,4,2,1,0,1,0,1,11]
[29,{"$f":"IF(A31<=ZREBOVANIE!$M$1,VLOOKUP(A31,RYBARI!A:C,3,0),\"x\")","v":"Révay Dušan"},1,3,0,1,4,2,4,3,18]
[30,{"$f":"IF(A32<=ZREBOVANIE!$M$1,VLOOKUP(A32,RYBARI!A:C,3,0),\"x\")","v":"Borovica Jozef"},5,3,3,2,0,0,2,4,19]
[31,{"$f":"IF(A33<=ZREBOVANIE!$M$1,VLOOKUP(A33,RYBARI!A:C,3,0),\"x\")","v":"Sýkora Jozef"},1,1,0,0,1,0,3,1,7]
[32,{"$f":"IF(A34<=ZREBOVANIE!$M$1,VLOOKUP(A34,RYBARI!A:C,3,0),\"x\")","v":"Zrubec Róbert"},5,5,2,3,3,0,2,4,24]
[33,{"$f":"IF(A35<=ZREBOVANIE!$M$1,VLOOKUP(A35,RYBARI!A:C,3,0),\"x\")","v":"Florek Tomáš"},5,2,0,0,2,0,0,2,11]
[34,{"$f":"IF(A36<=ZREBOVANIE!$M$1,VLOOKUP(A36,RYBARI!A:C,3,0),\"x\")","v":"Pavlíček Ľuboš"},5,1,1,0,1,1,1,4,14]
[35,{"$f":"IF(A37<=ZREBOVANIE!$M$1,VLOOKUP(A37,RYBARI!A:C,3,0),\"x\")","v":"Petráš Martin"},2,4,3,4,5,5,4,2,29]
[36,{"$f":"IF(A38<=ZREBOVANIE!$M$1,VLOOKUP(A38,RYBARI!A:C,3,0),\"x\")","v":"Hrivňák Ivan"},3,2,1,2,0,0,0,1,9]
[37,{"$f":"IF(A39<=ZREBOVANIE!$M$1,VLOOKUP(A39,RYBARI!A:C,3,0),\"x\")","v":"Mádr Tomáš"},2,1,0,0,1,1,1,0,6]
[38,{"$f":"IF(A40<=ZREBOVANIE!$M$1,VLOOKUP(A40,RYBARI!A:C,3,0),\"x\")","v":"Slávik Igor"},5,2,2,2,2,1,5,7,26]
[39,{"$f":"IF(A41<=ZREBOVANIE!$M$1,VLOOKUP(A41,RYBARI!A:C,3,0),\"x\")","v":"Petríček Stanislav"},5,2,5,0,3,1,1,2,19]
[40,{"$f":"IF(A42<=ZREBOVANIE!$M$1,VLOOKUP(A42,RYBARI!A:C,3,0),\"x\")","v":"Smorada Ján"},3,1,3,1,1,5,0,2,16]
[41,{"$f":"IF(A43<=ZREBOVANIE!$M$1,VLOOKUP(A43,RYBARI!A:C,3,0),\"x\")","v":"Schwarcz Roman"},5,2,3,1,1,2,2,1,17]
[42,{"$f":"IF(A44<=ZREBOVANIE!$M$1,VLOOKUP(A44,RYBARI!A:C,3,0),\"x\")","v":"Petríček Jaroslav"},7,1,3,3,2,4,5,2,27]
[43,{"$f":"IF(A45<=ZREBOVANIE!$M$1,VLOOKUP(A45,RYBARI!A:C,3,0),\"x\")","v":"Michalka Marián"},5,6,1,0,4,1,0,5,22]
[44,{"$f":"IF(A46<=ZREBOVANIE!$M$1,VLOOKUP(A46,RYBARI!A:C,3,0),\"x\")","v":"Pisarovič Erik"},1,1,2,3,1,1,3,1,13]
[45,{"$f":"IF(A47<=ZREBOVANIE!$M$1,VLOOKUP(A47,RYBARI!A:C,3,0),\"x\")","v":"Popovič Milan"},6,3,3,2,3,3,1,0,21]
[46,{"$f":"IF(A48<=ZREBOVANIE!$M$1,VLOOKUP(A48,RYBARI!A:C,3,0),\"x\")","v":"Slávik Michal"},2,3,1,4,1,4,4,1,20]
[47,{"$f":"IF(A49<=ZREBOVANIE!$M$1,VLOOKUP(A49,RYBARI!A:C,3,0),\"x\")","v":"Medo Peter"},4,1,2,2,3,1,1,0,14]
[48,{"$f":"IF(A50<=ZREBOVANIE!$M$1,VLOOKUP(A50,RYBARI!A:C,3,0),\"x\")","v":"x"},null,null,null,null,null,null,null,null,0]
[49,{"$f":"IF(A51<=ZREBOVANIE!$M$1,VLOOKUP(A51,RYBARI!A:C,3,0),\"x\")","v":"x"},null,null,null,null,null,null,null,null,0]
[50,{"$f":"IF(A52<=ZREBOVANIE!$M$1,VLOOKUP(A52,RYBARI!A:C,3,0),\"x\")","v":"x"},null,null,null,null,null,null,null,null,0]

{"sheet":"SÚBOJE","index":4,"n_rows":193,"n_cols":18,"rows_kept":193,"cut":false,"hidden":false,"merged":[]}
["Kolo","č1","č2","Rybár 1","Rybár 2","Počet rýb 1","Počet rýb 2","Body rybár 1","Body rybár 2",null,null,null,{"$f":"INDEX(TABULKA!$B$3:$B$52,$B1)","v":{"$error":"#VALUE!"}},{"$f":"INDEX(TABULKA!$B$3:$B$52,$C1)","v":{"$error":"#VALUE!"}},{"$f":"IF(ISBLANK(INDIRECT(ADDRESS(K1+2,$A1+2,1,1,\"tabulka\"),1)),\"-\",INDIRECT(ADDRESS(K1+2,$A1+2,1,1,\"tabulka\"),1))","v":{"$error":"#VALUE!"}},{"$f":"IF(ISBLANK(INDIRECT(ADDRESS(L1+2,$A1+2,1,1,\"tabulka\"),1)),\"-\",INDIRECT(ADDRESS(L1+2,$A1+2,1,1,\"tabulka\"),1))","v":{"$error":"#VALUE!"}},{"$f":"IF(OR($F1=\"-\",$G1=\"-\"),0,IF($F1>$G1,3,IF(AND($F1=0,$G1=0),1,IF($F1=$G1,1.5,0))))","v":0},{"$f":"IF(OR($F1=\"-\",$G1=\"-\"),0,IF($F1<$G1,3,IF(AND($F1=0,$G1=0),1,IF($F1=$G1,1.5,0))))","v":3}]
[1,1,2,{"$f":"INDEX(TABULKA!$B$3:$B$52,$B2)","v":"Šenigla Peter"},{"$f":"INDEX(TABULKA!$B$3:$B$52,$C2)","v":"Masarech Michal"},{"$f":"IF(ISBLANK(INDIRECT(ADDRESS(B2+2,$A2+2,1,1,\"tabulka\"),1)),\"-\",INDIRECT(ADDRESS(B2+2,$A2+2,1,1,\"tabulka\"),1))","v":4},{"$f":"IF(ISBLANK(INDIRECT(ADDRESS(C2+2,$A2+2,1,1,\"tabulka\"),1)),\"-\",INDIRECT(ADDRESS(C2+2,$A2+2,1,1,\"tabulka\"),1))","v":0},{"$f":"IF(OR($F2=\"-\",$G2=\"-\"),0,IF($F2>$G2,3,IF(AND($F2=0,$G2=0),1,IF($F2=$G2,1.5,0))))","v":3},{"$f":"IF(OR($F2=\"-\",$G2=\"-\"),0,IF($F2<$G2,3,IF(AND($F2=0,$G2=0),1,IF($F2=$G2,1.5,0))))","v":0}]
[1,3,4,{"$f":"INDEX(TABULKA!$B$3:$B$52,$B3)","v":"Mešenec Martin"},{"$f":"INDEX(TABULKA!$B$3:$B$52,$C3)","v":"Drančák David"},1,1,1.5,1.5]
[1,5,6,{"$f":"INDEX(TABULKA!$B$3:$B$52,$B4)","v":"Vančík Juraj"},{"$f":"INDEX(TABULKA!$B$3:$B$52,$C4)","v":"Mašan Tomáš"},0,2,0,3]
[1,7,8,{"$f":"INDEX(TABULKA!$B$3:$B$52,$B5)","v":"Daněk Michal"},{"$f":"INDEX(TABULKA!$B$3:$B$52,$C5)","v":"Kochan Ladislav"},2,3,0,3]
[1,9,10,{"$f":"INDEX(TABULKA!$B$3:$B$52,$B6)","v":"Spáčil Matej"},{"$f":"INDEX(TABULKA!$B$3:$B$52,$C6)","v":"Kollár Mikuláš"},2,5,0,3]
[1,11,12,{"$f":"INDEX(TABULKA!$B$3:$B$52,$B7)","v":"Kuhajda Rastislav"},{"$f":"INDEX(TABULKA!$B$3:$B$52,$C7)","v":"Šintál Adam"},4,4,1.5,1.5]
[1,13,14,{"$f":"INDEX(TABULKA!$B$3:$B$52,$B8)","v":"Kemencik Zoltán"},{"$f":"INDEX(TABULKA!$B$3:$B$52,$C8)","v":"Buršák Roman"},1,3,0,3]
[1,15,16,{"$f":"INDEX(TABULKA!$B$3:$B$52,$B9)","v":"Jarka Pavel"},{"$f":"INDEX(TABULKA!$B$3:$B$52,$C9)","v":"Kriho Marián"},2,5,0,3]
[1,17,18,{"$f":"INDEX(TABULKA!$B$3:$B$52,$B10)","v":"Onofrej Ivan"},{"$f":"INDEX(TABULKA!$B$3:$B$52,$C10)","v":"Smorada Marek"},1,2,0,3]
[1,19,20,{"$f":"INDEX(TABULKA!$B$3:$B$52,$B11)","v":"Hornák Filip"},{"$f":"INDEX(TABULKA!$B$3:$B$52,$C11)","v":"Mičo Martin"},2,5,0,3]
[1,21,22,{"$f":"INDEX(TABULKA!$B$3:$B$52,$B12)","v":"Medo Marián"},{"$f":"INDEX(TABULKA!$B$3:$B$52,$C12)","v":"Belovič Radoslav"},5,9,0,3]
[1,23,24,{"$f":"INDEX(TABULKA!$B$3:$B$52,$B13)","v":"Beňo Gabriel"},{"$f":"INDEX(TABULKA!$B$3:$B$52,$C13)","v":"Pecník Branislav"},3,4,0,3]
[1,25,26,{"$f":"INDEX(TABULKA!$B$3:$B$52,$B14)","v":"Drahoš Matúš"},{"$f":"INDEX(TABULKA!$B$3:$B$52,$C14)","v":"Krnčan Juraj"},2,3,0,3]
[1,27,28,{"$f":"INDEX(TABULKA!$B$3:$B$52,$B15)","v":"Mrázik Juraj"},{"$f":"INDEX(TABULKA!$B$3:$B$52,$C15)","v":"Šenigla Vladimír"},1,2,0,3]
[1,29,30,{"$f":"INDEX(TABULKA!$B$3:$B$52,$B16)","v":"Révay Dušan"},{"$f":"INDEX(TABULKA!$B$3:$B$52,$C16)","v":"Borovica Jozef"},1,5,0,3]
[1,31,32,{"$f":"INDEX(TABULKA!$B$3:$B$52,$B17)","v":"Sýkora Jozef"},{"$f":"INDEX(TABULKA!$B$3:$B$52,$C17)","v":"Zrubec Róbert"},1,5,0,3]
[1,33,34,{"$f":"INDEX(TABULKA!$B$3:$B$52,$B18)","v":"Florek Tomáš"},{"$f":"INDEX(TABULKA!$B$3:$B$52,$C18)","v":"Pavlíček Ľuboš"},5,5,1.5,1.5]
[1,35,36,{"$f":"INDEX(TABULKA!$B$3:$B$52,$B19)","v":"Petráš Martin"},{"$f":"INDEX(TABULKA!$B$3:$B$52,$C19)","v":"Hrivňák Ivan"},2,3,0,3]
[1,37,38,{"$f":"INDEX(TABULKA!$B$3:$B$52,$B20)","v":"Mádr Tomáš"},{"$f":"INDEX(TABULKA!$B$3:$B$52,$C20)","v":"Slávik Igor"},2,5,0,3]
[1,39,40,{"$f":"INDEX(TABULKA!$B$3:$B$52,$B21)","v":"Petríček Stanislav"},{"$f":"INDEX(TABULKA!$B$3:$B$52,$C21)","v":"Smorada Ján"},5,3,3,0]
[1,41,42,{"$f":"INDEX(TABULKA!$B$3:$B$52,$B22)","v":"Schwarcz Roman"},{"$f":"INDEX(TABULKA!$B$3:$B$52,$C22)","v":"Petríček Jaroslav"},5,7,0,3]
[1,43,44,{"$f":"INDEX(TABULKA!$B$3:$B$52,$B23)","v":"Michalka Marián"},{"$f":"INDEX(TABULKA!$B$3:$B$52,$C23)","v":"Pisarovič Erik"},5,1,3,0]
[1,45,46,{"$f":"INDEX(TABULKA!$B$3:$B$52,$B24)","v":"Popovič Milan"},{"$f":"INDEX(TABULKA!$B$3:$B$52,$C24)","v":"Slávik Michal"},6,2,3,0]
[1,47,46,{"$f":"INDEX(TABULKA!$B$3:$B$52,$B25)","v":"Medo Peter"},{"$f":"INDEX(TABULKA!$B$3:$B$52,$C25)","v":"Slávik Michal"},4,2,3]
[2,1,30,{"$f":"INDEX(TABULKA!$B$3:$B$52,$B26)","v":"Šenigla Peter"},{"$f":"INDEX(TABULKA!$B$3:$B$52,$C26)","v":"Borovica Jozef"},1,3,0,{"$f":"IF(OR($F26=\"-\",$G26=\"-\"),0,IF($F26<$G26,3,IF(AND($F26=0,$G26=0),1,IF($F26=$G26,1.5,0))))","v":3}]
[2,3,32,{"$f":"INDEX(TABULKA!$B$3:$B$52,$B27)","v":"Mešenec Martin"},{"$f":"INDEX(TABULKA!$B$3:$B$52,$C27)","v":"Zrubec Róbert"},4,5,0,3]
[2,5,34,{"$f":"INDEX(TABULKA!$B$3:$B$52,$B28)","v":"Vančík Juraj"},{"$f":"INDEX(TABULKA!$B$3:$B$52,$C28)","v":"Pavlíček Ľuboš"},2,1,3,0]
[2,7,36,{"$f":"INDEX(TABULKA!$B$3:$B$52,$B29)","v":"Daněk Michal"},{"$f":"INDEX(TABULKA!$B$3:$B$52,$C29)","v":"Hrivňák Ivan"},3,2,3,0]
[2,9,38,{"$f":"INDEX(TABULKA!$B$3:$B$52,$B30)","v":"Spáčil Matej"},{"$f":"INDEX(TABULKA!$B$3:$B$52,$C30)","v":"Slávik Igor"},5,2,3,0]
[2,11,40,{"$f":"INDEX(TABULKA!$B$3:$B$52,$B31)","v":"Kuhajda Rastislav"},{"$f":"INDEX(TABULKA!$B$3:$B$52,$C31)","v":"Smorada Ján"},2,1,3,0]
[2,13,42,{"$f":"INDEX(TABULKA!$B$3:$B$52,$B32)","v":"Kemencik Zoltán"},{"$f":"INDEX(TABULKA!$B$3:$B$52,$C32)","v":"Petríček Jaroslav"},1,1,1.5,1.5]
[2,15,44,{"$f":"INDEX(TABULKA!$B$3:$B$52,$B33)","v":"Jarka Pavel"},{"$f":"INDEX(TABULKA!$B$3:$B$52,$C33)","v":"Pisarovič Erik"},2,1,3,0]
[2,17,46,{"$f":"INDEX(TABULKA!$B$3:$B$52,$B34)","v":"Onofrej Ivan"},{"$f":"INDEX(TABULKA!$B$3:$B$52,$C34)","v":"Slávik Michal"},{"$f":"IF(ISBLANK(INDIRECT(ADDRESS(B34+2,$A34+2,1,1,\"tabulka\"),1)),\"-\",INDIRECT(ADDRESS(B34+2,$A34+2,1,1,\"tabulka\"),1))","v":0},{"$f":"IF(ISBLANK(INDIRECT(ADDRESS(C34+2,$A34+2,1,1,\"tabulka\"),1)),\"-\",INDIRECT(ADDRESS(C34+2,$A34+2,1,1,\"tabulka\"),1))","v":3},{"$f":"IF(OR($F34=\"-\",$G34=\"-\"),0,IF($F34>$G34,3,IF(AND($F34=0,$G34=0),1,IF($F34=$G34,1.5,0))))","v":0},3]
[2,19,21,{"$f":"INDEX(TABULKA!$B$3:$B$52,$B35)","v":"Hornák Filip"},{"$f":"INDEX(TABULKA!$B$3:$B$52,$C35)","v":"Medo Marián"},1,0,3]
[2,21,2,{"$f":"INDEX(TABULKA!$B$3:$B$52,$B36)","v":"Medo Marián"},{"$f":"INDEX(TABULKA!$B$3:$B$52,$C36)","v":"Masarech Michal"},0,0,1,{"$f":"IF(OR($F36=\"-\",$G36=\"-\"),0,IF($F36<$G36,3,IF(AND($F36=0,$G36=0),1,IF($F36=$G36,1.5,0))))","v":1}]
[2,23,4,{"$f":"INDEX(TABULKA!$B$3:$B$52,$B37)","v":"Beňo Gabriel"},{"$f":"INDEX(TABULKA!$B$3:$B$52,$C37)","v":"Drančák David"},1,2,0,3]
[2,25,6,{"$f":"INDEX(TABULKA!$B$3:$B$52,$B38)","v":"Drahoš Matúš"},{"$f":"INDEX(TABULKA!$B$3:$B$52,$C38)","v":"Mašan Tomáš"},3,3,1.5,1.5]
[2,27,8,{"$f":"INDEX(TABULKA!$B$3:$B$52,$B39)","v":"Mrázik Juraj"},{"$f":"INDEX(TABULKA!$B$3:$B$52,$C39)","v":"Kochan Ladislav"},0,0,1,1]
[2,29,10,{"$f":"INDEX(TABULKA!$B$3:$B$52,$B40)","v":"Révay Dušan"},{"$f":"INDEX(TABULKA!$B$3:$B$52,$C40)","v":"Kollár Mikuláš"},3,1,3,0]
[2,31,12,{"$f":"INDEX(TABULKA!$B$3:$B$52,$B41)","v":"Sýkora Jozef"},{"$f":"INDEX(TABULKA!$B$3:$B$52,$C41)","v":"Šintál Adam"},1,3,0,3]
[2,33,14,{"$f":"INDEX(TABULKA!$B$3:$B$52,$B42)","v":"Florek Tomáš"},{"$f":"INDEX(TABULKA!$B$3:$B$52,$C42)","v":"Buršák Roman"},2,3,0,3]
[2,35,16,{"$f":"INDEX(TABULKA!$B$3:$B$52,$B43)","v":"Petráš Martin"},{"$f":"INDEX(TABULKA!$B$3:$B$52,$C43)","v":"Kriho Marián"},4,4,1.5,1.5]
[2,37,18,{"$f":"INDEX(TABULKA!$B$3:$B$52,$B44)","v":"Mádr Tomáš"},{"$f":"INDEX(TABULKA!$B$3:$B$52,$C44)","v":"Smorada Marek"},1,2,0,3]
[2,39,20,{"$f":"INDEX(TABULKA!$B$3:$B$52,$B45)","v":"Petríček Stanislav"},{"$f":"INDEX(TABULKA!$B$3:$B$52,$C45)","v":"Mičo Martin"},2,5,0,3]
[2,41,22,{"$f":"INDEX(TABULKA!$B$3:$B$52,$B46)","v":"Schwarcz Roman"},{"$f":"INDEX(TABULKA!$B$3:$B$52,$C46)","v":"Belovič Radoslav"},2,3,0,3]
[2,43,24,{"$f":"INDEX(TABULKA!$B$3:$B$52,$B47)","v":"Michalka Marián"},{"$f":"INDEX(TABULKA!$B$3:$B$52,$C47)","v":"Pecník Branislav"},6,5,3,0]
[2,45,26,{"$f":"INDEX(TABULKA!$B$3:$B$52,$B48)","v":"Popovič Milan"},{"$f":"INDEX(TABULKA!$B$3:$B$52,$C48)","v":"Krnčan Juraj"},3,3,1.5,1.5]
[2,47,28,{"$f":"INDEX(TABULKA!$B$3:$B$52,$B49)","v":"Medo Peter"},{"$f":"INDEX(TABULKA!$B$3:$B$52,$C49)","v":"Šenigla Vladimír"},1,4,0,3]
[3,1,10,{"$f":"INDEX(TABULKA!$B$3:$B$52,$B50)","v":"Šenigla Peter"},{"$f":"INDEX(TABULKA!$B$3:$B$52,$C50)","v":"Kollár Mikuláš"},3,2,3,0]
[3,3,12,{"$f":"INDEX(TABULKA!$B$3:$B$52,$B51)","v":"Mešenec Martin"},{"$f":"INDEX(TABULKA!$B$3:$B$52,$C51)","v":"Šintál Adam"},2,2,1.5,1.5]
[3,5,14,{"$f":"INDEX(TABULKA!$B$3:$B$52,$B52)","v":"Vančík Juraj"},{"$f":"INDEX(TABULKA!$B$3:$B$52,$C52)","v":"Buršák Roman"},0,4,0,3]
[3,7,16,{"$f":"INDEX(TABULKA!$B$3:$B$52,$B53)","v":"Daněk Michal"},{"$f":"INDEX(TABULKA!$B$3:$B$52,$C53)","v":"Kriho Marián"},0,4,0,3]
[3,9,18,{"$f":"INDEX(TABULKA!$B$3:$B$52,$B54)","v":"Spáčil Matej"},{"$f":"INDEX(TABULKA!$B$3:$B$52,$C54)","v":"Smorada Marek"},0,4,0,3]
[3,11,20,{"$f":"INDEX(TABULKA!$B$3:$B$52,$B55)","v":"Kuhajda Rastislav"},{"$f":"INDEX(TABULKA!$B$3:$B$52,$C55)","v":"Mičo Martin"},3,5,0,3]
[3,13,22,{"$f":"INDEX(TABULKA!$B$3:$B$52,$B56)","v":"Kemencik Zoltán"},{"$f":"INDEX(TABULKA!$B$3:$B$52,$C56)","v":"Belovič Radoslav"},3,6,0,3]
[3,15,24,{"$f":"INDEX(TABULKA!$B$3:$B$52,$B57)","v":"Jarka Pavel"},{"$f":"INDEX(TABULKA!$B$3:$B$52,$C57)","v":"Pecník Branislav"},3,2,3,0]
[3,17,26,{"$f":"INDEX(TABULKA!$B$3:$B$52,$B58)","v":"Onofrej Ivan"},{"$f":"INDEX(TABULKA!$B$3:$B$52,$C58)","v":"Krnčan Juraj"},2,4,0,3]
[3,19,28,{"$f":"INDEX(TABULKA!$B$3:$B$52,$B59)","v":"Hornák Filip"},{"$f":"INDEX(TABULKA!$B$3:$B$52,$C59)","v":"Šenigla Vladimír"},0,2,0,3]
[3,21,30,{"$f":"INDEX(TABULKA!$B$3:$B$52,$B60)","v":"Medo Marián"},{"$f":"INDEX(TABULKA!$B$3:$B$52,$C60)","v":"Borovica Jozef"},0,3,0,3]
[3,23,32,{"$f":"INDEX(TABULKA!$B$3:$B$52,$B61)","v":"Beňo Gabriel"},{"$f":"INDEX(TABULKA!$B$3:$B$52,$C61)","v":"Zrubec Róbert"},1,2,0,3]
[3,25,34,{"$f":"INDEX(TABULKA!$B$3:$B$52,$B62)","v":"Drahoš Matúš"},{"$f":"INDEX(TABULKA!$B$3:$B$52,$C62)","v":"Pavlíček Ľuboš"},1,1,1.5,1.5]
[3,27,36,{"$f":"INDEX(TABULKA!$B$3:$B$52,$B63)","v":"Mrázik Juraj"},{"$f":"INDEX(TABULKA!$B$3:$B$52,$C63)","v":"Hrivňák Ivan"},0,1,0,3]
[3,29,38,{"$f":"INDEX(TABULKA!$B$3:$B$52,$B64)","v":"Révay Dušan"},{"$f":"INDEX(TABULKA!$B$3:$B$52,$C64)","v":"Slávik Igor"},0,2,0,3]
[3,31,40,{"$f":"INDEX(TABULKA!$B$3:$B$52,$B65)","v":"Sýkora Jozef"},{"$f":"INDEX(TABULKA!$B$3:$B$52,$C65)","v":"Smorada Ján"},0,3,0,3]
[3,33,42,{"$f":"INDEX(TABULKA!$B$3:$B$52,$B66)","v":"Florek Tomáš"},{"$f":"INDEX(TABULKA!$B$3:$B$52,$C66)","v":"Petríček Jaroslav"},{"$f":"IF(ISBLANK(INDIRECT(ADDRESS(B66+2,$A66+2,1,1,\"tabulka\"),1)),\"-\",INDIRECT(ADDRESS(B66+2,$A66+2,1,1,\"tabulka\"),1))","v":0},{"$f":"IF(ISBLANK(INDIRECT(ADDRESS(C66+2,$A66+2,1,1,\"tabulka\"),1)),\"-\",INDIRECT(ADDRESS(C66+2,$A66+2,1,1,\"tabulka\"),1))","v":3},{"$f":"IF(OR($F66=\"-\",$G66=\"-\"),0,IF($F66>$G66,3,IF(AND($F66=0,$G66=0),1,IF($F66=$G66,1.5,0))))","v":0},3]
[3,35,44,{"$f":"INDEX(TABULKA!$B$3:$B$52,$B67)","v":"Petráš Martin"},{"$f":"INDEX(TABULKA!$B$3:$B$52,$C67)","v":"Pisarovič Erik"},3,2,3,0]
[3,37,46,{"$f":"INDEX(TABULKA!$B$3:$B$52,$B68)","v":"Mádr Tomáš"},{"$f":"INDEX(TABULKA!$B$3:$B$52,$C68)","v":"Slávik Michal"},0,1,0,3]
[3,39,46,{"$f":"INDEX(TABULKA!$B$3:$B$52,$B69)","v":"Petríček Stanislav"},{"$f":"INDEX(TABULKA!$B$3:$B$52,$C69)","v":"Slávik Michal"},5,1,3]
[3,41,2,{"$f":"INDEX(TABULKA!$B$3:$B$52,$B70)","v":"Schwarcz Roman"},{"$f":"INDEX(TABULKA!$B$3:$B$52,$C70)","v":"Masarech Michal"},3,1,3,{"$f":"IF(OR($F70=\"-\",$G70=\"-\"),0,IF($F70<$G70,3,IF(AND($F70=0,$G70=0),1,IF($F70=$G70,1.5,0))))","v":0}]
[3,43,4,{"$f":"INDEX(TABULKA!$B$3:$B$52,$B71)","v":"Michalka Marián"},{"$f":"INDEX(TABULKA!$B$3:$B$52,$C71)","v":"Drančák David"},1,4,0,3]
[3,45,6,{"$f":"INDEX(TABULKA!$B$3:$B$52,$B72)","v":"Popovič Milan"},{"$f":"INDEX(TABULKA!$B$3:$B$52,$C72)","v":"Mašan Tomáš"},3,4,0,3]
[3,47,8,{"$f":"INDEX(TABULKA!$B$3:$B$52,$B73)","v":"Medo Peter"},{"$f":"INDEX(TABULKA!$B$3:$B$52,$C73)","v":"Kochan Ladislav"},2,0,3,0]
[4,1,38,{"$f":"INDEX(TABULKA!$B$3:$B$52,$B74)","v":"Šenigla Peter"},{"$f":"INDEX(TABULKA!$B$3:$B$52,$C74)","v":"Slávik Igor"},2,2,1.5,1.5]
[4,3,40,{"$f":"INDEX(TABULKA!$B$3:$B$52,$B75)","v":"Mešenec Martin"},{"$f":"INDEX(TABULKA!$B$3:$B$52,$C75)","v":"Smorada Ján"},1,1,1.5,1.5]
[4,5,42,{"$f":"INDEX(TABULKA!$B$3:$B$52,$B76)","v":"Vančík Juraj"},{"$f":"INDEX(TABULKA!$B$3:$B$52,$C76)","v":"Petríček Jaroslav"},1,3,0,3]
[4,7,44,{"$f":"INDEX(TABULKA!$B$3:$B$52,$B77)","v":"Daněk Michal"},{"$f":"INDEX(TABULKA!$B$3:$B$52,$C77)","v":"Pisarovič Erik"},6,3,3,0]
[4,9,46,{"$f":"INDEX(TABULKA!$B$3:$B$52,$B78)","v":"Spáčil Matej"},{"$f":"INDEX(TABULKA!$B$3:$B$52,$C78)","v":"Slávik Michal"},0,4,0,3]
[4,11,13,{"$f":"INDEX(TABULKA!$B$3:$B$52,$B79)","v":"Kuhajda Rastislav"},{"$f":"INDEX(TABULKA!$B$3:$B$52,$C79)","v":"Kemencik Zoltán"},1,0,3]
[4,13,2,{"$f":"INDEX(TABULKA!$B$3:$B$52,$B80)","v":"Kemencik Zoltán"},{"$f":"INDEX(TABULKA!$B$3:$B$52,$C80)","v":"Masarech Michal"},0,1,0,{"$f":"IF(OR($F80=\"-\",$G80=\"-\"),0,IF($F80<$G80,3,IF(AND($F80=0,$G80=0),1,IF($F80=$G80,1.5,0))))","v":3}]
[4,15,4,{"$f":"INDEX(TABULKA!$B$3:$B$52,$B81)","v":"Jarka Pavel"},{"$f":"INDEX(TABULKA!$B$3:$B$52,$C81)","v":"Drančák David"},3,0,3,0]
[4,17,6,{"$f":"INDEX(TABULKA!$B$3:$B$52,$B82)","v":"Onofrej Ivan"},{"$f":"INDEX(TABULKA!$B$3:$B$52,$C82)","v":"Mašan Tomáš"},1,2,0,3]
[4,19,8,{"$f":"INDEX(TABULKA!$B$3:$B$52,$B83)","v":"Hornák Filip"},{"$f":"INDEX(TABULKA!$B$3:$B$52,$C83)","v":"Kochan Ladislav"},1,1,1.5,1.5]
[4,21,10,{"$f":"INDEX(TABULKA!$B$3:$B$52,$B84)","v":"Medo Marián"},{"$f":"INDEX(TABULKA!$B$3:$B$52,$C84)","v":"Kollár Mikuláš"},1,2,0,3]
[4,23,12,{"$f":"INDEX(TABULKA!$B$3:$B$52,$B85)","v":"Beňo Gabriel"},{"$f":"INDEX(TABULKA!$B$3:$B$52,$C85)","v":"Šintál Adam"},0,1,0,3]
[4,25,14,{"$f":"INDEX(TABULKA!$B$3:$B$52,$B86)","v":"Drahoš Matúš"},{"$f":"INDEX(TABULKA!$B$3:$B$52,$C86)","v":"Buršák Roman"},5,1,3,0]
[4,27,16,{"$f":"INDEX(TABULKA!$B$3:$B$52,$B87)","v":"Mrázik Juraj"},{"$f":"INDEX(TABULKA!$B$3:$B$52,$C87)","v":"Kriho Marián"},2,3,0,3]
[4,29,18,{"$f":"INDEX(TABULKA!$B$3:$B$52,$B88)","v":"Révay Dušan"},{"$f":"INDEX(TABULKA!$B$3:$B$52,$C88)","v":"Smorada Marek"},1,3,0,3]
[4,31,20,{"$f":"INDEX(TABULKA!$B$3:$B$52,$B89)","v":"Sýkora Jozef"},{"$f":"INDEX(TABULKA!$B$3:$B$52,$C89)","v":"Mičo Martin"},0,1,0,3]
[4,33,22,{"$f":"INDEX(TABULKA!$B$3:$B$52,$B90)","v":"Florek Tomáš"},{"$f":"INDEX(TABULKA!$B$3:$B$52,$C90)","v":"Belovič Radoslav"},0,1,0,3]
[4,35,24,{"$f":"INDEX(TABULKA!$B$3:$B$52,$B91)","v":"Petráš Martin"},{"$f":"INDEX(TABULKA!$B$3:$B$52,$C91)","v":"Pecník Branislav"},4,1,3,0]
[4,37,26,{"$f":"INDEX(TABULKA!$B$3:$B$52,$B92)","v":"Mádr Tomáš"},{"$f":"INDEX(TABULKA!$B$3:$B$52,$C92)","v":"Krnčan Juraj"},0,1,0,3]
[4,39,28,{"$f":"INDEX(TABULKA!$B$3:$B$52,$B93)","v":"Petríček Stanislav"},{"$f":"INDEX(TABULKA!$B$3:$B$52,$C93)","v":"Šenigla Vladimír"},0,1,0,3]
[4,41,30,{"$f":"INDEX(TABULKA!$B$3:$B$52,$B94)","v":"Schwarcz Roman"},{"$f":"INDEX(TABULKA!$B$3:$B$52,$C94)","v":"Borovica Jozef"},1,2,0,3]
[4,43,32,{"$f":"INDEX(TABULKA!$B$3:$B$52,$B95)","v":"Michalka Marián"},{"$f":"INDEX(TABULKA!$B$3:$B$52,$C95)","v":"Zrubec Róbert"},0,3,0,3]
[4,45,34,{"$f":"INDEX(TABULKA!$B$3:$B$52,$B96)","v":"Popovič Milan"},{"$f":"INDEX(TABULKA!$B$3:$B$52,$C96)","v":"Pavlíček Ľuboš"},2,0,3,0]
[4,47,36,{"$f":"INDEX(TABULKA!$B$3:$B$52,$B97)","v":"Medo Peter"},{"$f":"INDEX(TABULKA!$B$3:$B$52,$C97)","v":"Hrivňák Ivan"},2,2,1.5,1.5]
[5,1,18,{"$f":"INDEX(TABULKA!$B$3:$B$52,$B98)","v":"Šenigla Peter"},{"$f":"INDEX(TABULKA!$B$3:$B$52,$C98)","v":"Smorada Marek"},{"$f":"IF(ISBLANK(INDIRECT(ADDRESS(B98+2,$A98+2,1,1,\"tabulka\"),1)),\"-\",INDIRECT(ADDRESS(B98+2,$A98+2,1,1,\"tabulka\"),1))","v":5},{"$f":"IF(ISBLANK(INDIRECT(ADDRESS(C98+2,$A98+2,1,1,\"tabulka\"),1)),\"-\",INDIRECT(ADDRESS(C98+2,$A98+2,1,1,\"tabulka\"),1))","v":3},{"$f":"IF(OR($F98=\"-\",$G98=\"-\"),0,IF($F98>$G98,3,IF(AND($F98=0,$G98=0),1,IF($F98=$G98,1.5,0))))","v":3},0]
[5,3,20,{"$f":"INDEX(TABULKA!$B$3:$B$52,$B99)","v":"Mešenec Martin"},{"$f":"INDEX(TABULKA!$B$3:$B$52,$C99)","v":"Mičo Martin"},4,2,3,0]
[5,5,22,{"$f":"INDEX(TABULKA!$B$3:$B$52,$B100)","v":"Vančík Juraj"},{"$f":"INDEX(TABULKA!$B$3:$B$52,$C100)","v":"Belovič Radoslav"},2,2,1.5,1.5]
[5,7,24,{"$f":"INDEX(TABULKA!$B$3:$B$52,$B101)","v":"Daněk Michal"},{"$f":"INDEX(TABULKA!$B$3:$B$52,$C101)","v":"Pecník Branislav"},6,3,3,0]
[5,9,26,{"$f":"INDEX(TABULKA!$B$3:$B$52,$B102)","v":"Spáčil Matej"},{"$f":"INDEX(TABULKA!$B$3:$B$52,$C102)","v":"Krnčan Juraj"},3,2,3,0]
[5,11,28,{"$f":"INDEX(TABULKA!$B$3:$B$52,$B103)","v":"Kuhajda Rastislav"},{"$f":"INDEX(TABULKA!$B$3:$B$52,$C103)","v":"Šenigla Vladimír"},2,0,3,0]
[5,13,30,{"$f":"INDEX(TABULKA!$B$3:$B$52,$B104)","v":"Kemencik Zoltán"},{"$f":"INDEX(TABULKA!$B$3:$B$52,$C104)","v":"Borovica Jozef"},1,0,3,0]
[5,15,32,{"$f":"INDEX(TABULKA!$B$3:$B$52,$B105)","v":"Jarka Pavel"},{"$f":"INDEX(TABULKA!$B$3:$B$52,$C105)","v":"Zrubec Róbert"},1,3,0,3]
[5,17,34,{"$f":"INDEX(TABULKA!$B$3:$B$52,$B106)","v":"Onofrej Ivan"},{"$f":"INDEX(TABULKA!$B$3:$B$52,$C106)","v":"Pavlíček Ľuboš"},1,1,1.5,1.5]
[5,19,36,{"$f":"INDEX(TABULKA!$B$3:$B$52,$B107)","v":"Hornák Filip"},{"$f":"INDEX(TABULKA!$B$3:$B$52,$C107)","v":"Hrivňák Ivan"},1,0,3,0]
[5,21,38,{"$f":"INDEX(TABULKA!$B$3:$B$52,$B108)","v":"Medo Marián"},{"$f":"INDEX(TABULKA!$B$3:$B$52,$C108)","v":"Slávik Igor"},1,2,0,3]
[5,23,40,{"$f":"INDEX(TABULKA!$B$3:$B$52,$B109)","v":"Beňo Gabriel"},{"$f":"INDEX(TABULKA!$B$3:$B$52,$C109)","v":"Smorada Ján"},1,1,1.5,1.5]
[5,25,42,{"$f":"INDEX(TABULKA!$B$3:$B$52,$B110)","v":"Drahoš Matúš"},{"$f":"INDEX(TABULKA!$B$3:$B$52,$C110)","v":"Petríček Jaroslav"},0,2,0,3]
[5,27,44,{"$f":"INDEX(TABULKA!$B$3:$B$52,$B111)","v":"Mrázik Juraj"},{"$f":"INDEX(TABULKA!$B$3:$B$52,$C111)","v":"Pisarovič Erik"},0,1,0,3]
[5,29,46,{"$f":"INDEX(TABULKA!$B$3:$B$52,$B112)","v":"Révay Dušan"},{"$f":"INDEX(TABULKA!$B$3:$B$52,$C112)","v":"Slávik Michal"},4,1,3,0]
[5,31,46,{"$f":"INDEX(TABULKA!$B$3:$B$52,$B113)","v":"Sýkora Jozef"},{"$f":"INDEX(TABULKA!$B$3:$B$52,$C113)","v":"Slávik Michal"},1,1,1.5]
[5,33,2,{"$f":"INDEX(TABULKA!$B$3:$B$52,$B114)","v":"Florek Tomáš"},{"$f":"INDEX(TABULKA!$B$3:$B$52,$C114)","v":"Masarech Michal"},2,2,1.5,{"$f":"IF(OR($F114=\"-\",$G114=\"-\"),0,IF($F114<$G114,3,IF(AND($F114=0,$G114=0),1,IF($F114=$G114,1.5,0))))","v":1.5}]
[5,35,4,{"$f":"INDEX(TABULKA!$B$3:$B$52,$B115)","v":"Petráš Martin"},{"$f":"INDEX(TABULKA!$B$3:$B$52,$C115)","v":"Drančák David"},5,5,1.5,1.5]
[5,37,6,{"$f":"INDEX(TABULKA!$B$3:$B$52,$B116)","v":"Mádr Tomáš"},{"$f":"INDEX(TABULKA!$B$3:$B$52,$C116)","v":"Mašan Tomáš"},1,4,0,3]
[5,39,8,{"$f":"INDEX(TABULKA!$B$3:$B$52,$B117)","v":"Petríček Stanislav"},{"$f":"INDEX(TABULKA!$B$3:$B$52,$C117)","v":"Kochan Ladislav"},3,2,3,0]
[5,41,10,{"$f":"INDEX(TABULKA!$B$3:$B$52,$B118)","v":"Schwarcz Roman"},{"$f":"INDEX(TABULKA!$B$3:$B$52,$C118)","v":"Kollár Mikuláš"},1,1,1.5,1.5]
[5,43,12,{"$f":"INDEX(TABULKA!$B$3:$B$52,$B119)","v":"Michalka Marián"},{"$f":"INDEX(TABULKA!$B$3:$B$52,$C119)","v":"Šintál Adam"},4,5,0,3]
[5,45,14,{"$f":"INDEX(TABULKA!$B$3:$B$52,$B120)","v":"Popovič Milan"},{"$f":"INDEX(TABULKA!$B$3:$B$52,$C120)","v":"Buršák Roman"},3,1,3,0]
[5,47,16,{"$f":"INDEX(TABULKA!$B$3:$B$52,$B121)","v":"Medo Peter"},{"$f":"INDEX(TABULKA!$B$3:$B$52,$C121)","v":"Kriho Marián"},3,2,3,0]
[6,1,46,{"$f":"INDEX(TABULKA!$B$3:$B$52,$B122)","v":"Šenigla Peter"},{"$f":"INDEX(TABULKA!$B$3:$B$52,$C122)","v":"Slávik Michal"},3,4,0,3]
[6,3,5,{"$f":"INDEX(TABULKA!$B$3:$B$52,$B123)","v":"Mešenec Martin"},{"$f":"INDEX(TABULKA!$B$3:$B$52,$C123)","v":"Vančík Juraj"},3,0,3]
[6,5,2,{"$f":"INDEX(TABULKA!$B$3:$B$52,$B124)","v":"Vančík Juraj"},{"$f":"INDEX(TABULKA!$B$3:$B$52,$C124)","v":"Masarech Michal"},0,1,0,{"$f":"IF(OR($F124=\"-\",$G124=\"-\"),0,IF($F124<$G124,3,IF(AND($F124=0,$G124=0),1,IF($F124=$G124,1.5,0))))","v":3}]
[6,7,4,{"$f":"INDEX(TABULKA!$B$3:$B$52,$B125)","v":"Daněk Michal"},{"$f":"INDEX(TABULKA!$B$3:$B$52,$C125)","v":"Drančák David"},3,2,3,0]
[6,9,6,{"$f":"INDEX(TABULKA!$B$3:$B$52,$B126)","v":"Spáčil Matej"},{"$f":"INDEX(TABULKA!$B$3:$B$52,$C126)","v":"Mašan Tomáš"},2,3,0,3]
[6,11,8,{"$f":"INDEX(TABULKA!$B$3:$B$52,$B127)","v":"Kuhajda Rastislav"},{"$f":"INDEX(TABULKA!$B$3:$B$52,$C127)","v":"Kochan Ladislav"},1,0,3,0]
[6,13,10,{"$f":"INDEX(TABULKA!$B$3:$B$52,$B128)","v":"Kemencik Zoltán"},{"$f":"INDEX(TABULKA!$B$3:$B$52,$C128)","v":"Kollár Mikuláš"},1,0,3,0]
[6,15,12,{"$f":"INDEX(TABULKA!$B$3:$B$52,$B129)","v":"Jarka Pavel"},{"$f":"INDEX(TABULKA!$B$3:$B$52,$C129)","v":"Šintál Adam"},1,1,1.5,1.5]
[6,17,14,{"$f":"INDEX(TABULKA!$B$3:$B$52,$B130)","v":"Onofrej Ivan"},{"$f":"INDEX(TABULKA!$B$3:$B$52,$C130)","v":"Buršák Roman"},{"$f":"IF(ISBLANK(INDIRECT(ADDRESS(B130+2,$A130+2,1,1,\"tabulka\"),1)),\"-\",INDIRECT(ADDRESS(B130+2,$A130+2,1,1,\"tabulka\"),1))","v":2},{"$f":"IF(ISBLANK(INDIRECT(ADDRESS(C130+2,$A130+2,1,1,\"tabulka\"),1)),\"-\",INDIRECT(ADDRESS(C130+2,$A130+2,1,1,\"tabulka\"),1))","v":4},{"$f":"IF(OR($F130=\"-\",$G130=\"-\"),0,IF($F130>$G130,3,IF(AND($F130=0,$G130=0),1,IF($F130=$G130,1.5,0))))","v":0},3]
[6,19,16,{"$f":"INDEX(TABULKA!$B$3:$B$52,$B131)","v":"Hornák Filip"},{"$f":"INDEX(TABULKA!$B$3:$B$52,$C131)","v":"Kriho Marián"},0,2,0,3]
[6,21,18,{"$f":"INDEX(TABULKA!$B$3:$B$52,$B132)","v":"Medo Marián"},{"$f":"INDEX(TABULKA!$B$3:$B$52,$C132)","v":"Smorada Marek"},1,4,0,3]
[6,23,20,{"$f":"INDEX(TABULKA!$B$3:$B$52,$B133)","v":"Beňo Gabriel"},{"$f":"INDEX(TABULKA!$B$3:$B$52,$C133)","v":"Mičo Martin"},0,4,0,3]
[6,25,22,{"$f":"INDEX(TABULKA!$B$3:$B$52,$B134)","v":"Drahoš Matúš"},{"$f":"INDEX(TABULKA!$B$3:$B$52,$C134)","v":"Belovič Radoslav"},4,2,3,0]
[6,27,24,{"$f":"INDEX(TABULKA!$B$3:$B$52,$B135)","v":"Mrázik Juraj"},{"$f":"INDEX(TABULKA!$B$3:$B$52,$C135)","v":"Pecník Branislav"},1,1,1.5,1.5]
[6,29,26,{"$f":"INDEX(TABULKA!$B$3:$B$52,$B136)","v":"Révay Dušan"},{"$f":"INDEX(TABULKA!$B$3:$B$52,$C136)","v":"Krnčan Juraj"},2,2,1.5,1.5]
[6,31,28,{"$f":"INDEX(TABULKA!$B$3:$B$52,$B137)","v":"Sýkora Jozef"},{"$f":"INDEX(TABULKA!$B$3:$B$52,$C137)","v":"Šenigla Vladimír"},0,1,0,3]
[6,33,30,{"$f":"INDEX(TABULKA!$B$3:$B$52,$B138)","v":"Florek Tomáš"},{"$f":"INDEX(TABULKA!$B$3:$B$52,$C138)","v":"Borovica Jozef"},0,0,1,1]
[6,35,32,{"$f":"INDEX(TABULKA!$B$3:$B$52,$B139)","v":"Petráš Martin"},{"$f":"INDEX(TABULKA!$B$3:$B$52,$C139)","v":"Zrubec Róbert"},5,0,3,0]
[6,37,34,{"$f":"INDEX(TABULKA!$B$3:$B$52,$B140)","v":"Mádr Tomáš"},{"$f":"INDEX(TABULKA!$B$3:$B$52,$C140)","v":"Pavlíček Ľuboš"},1,1,1.5,1.5]
[6,39,36,{"$f":"INDEX(TABULKA!$B$3:$B$52,$B141)","v":"Petríček Stanislav"},{"$f":"INDEX(TABULKA!$B$3:$B$52,$C141)","v":"Hrivňák Ivan"},1,0,3,0]
[6,41,38,{"$f":"INDEX(TABULKA!$B$3:$B$52,$B142)","v":"Schwarcz Roman"},{"$f":"INDEX(TABULKA!$B$3:$B$52,$C142)","v":"Slávik Igor"},2,1,3,0]
[6,43,40,{"$f":"INDEX(TABULKA!$B$3:$B$52,$B143)","v":"Michalka Marián"},{"$f":"INDEX(TABULKA!$B$3:$B$52,$C143)","v":"Smorada Ján"},1,5,0,3]
[6,45,42,{"$f":"INDEX(TABULKA!$B$3:$B$52,$B144)","v":"Popovič Milan"},{"$f":"INDEX(TABULKA!$B$3:$B$52,$C144)","v":"Petríček Jaroslav"},3,4,0,3]
[6,47,44,{"$f":"INDEX(TABULKA!$B$3:$B$52,$B145)","v":"Medo Peter"},{"$f":"INDEX(TABULKA!$B$3:$B$52,$C145)","v":"Pisarovič Erik"},1,1,1.5,1.5]
[7,1,26,{"$f":"INDEX(TABULKA!$B$3:$B$52,$B146)","v":"Šenigla Peter"},{"$f":"INDEX(TABULKA!$B$3:$B$52,$C146)","v":"Krnčan Juraj"},2,1,3,0]
[7,3,28,{"$f":"INDEX(TABULKA!$B$3:$B$52,$B147)","v":"Mešenec Martin"},{"$f":"INDEX(TABULKA!$B$3:$B$52,$C147)","v":"Šenigla Vladimír"},2,0,3,0]
[7,5,30,{"$f":"INDEX(TABULKA!$B$3:$B$52,$B148)","v":"Vančík Juraj"},{"$f":"INDEX(TABULKA!$B$3:$B$52,$C148)","v":"Borovica Jozef"},2,2,1.5,1.5]
[7,7,32,{"$f":"INDEX(TABULKA!$B$3:$B$52,$B149)","v":"Daněk Michal"},{"$f":"INDEX(TABULKA!$B$3:$B$52,$C149)","v":"Zrubec Róbert"},5,2,3,0]
[7,9,34,{"$f":"INDEX(TABULKA!$B$3:$B$52,$B150)","v":"Spáčil Matej"},{"$f":"INDEX(TABULKA!$B$3:$B$52,$C150)","v":"Pavlíček Ľuboš"},3,1,3,0]
[7,11,36,{"$f":"INDEX(TABULKA!$B$3:$B$52,$B151)","v":"Kuhajda Rastislav"},{"$f":"INDEX(TABULKA!$B$3:$B$52,$C151)","v":"Hrivňák Ivan"},1,0,3,0]
[7,13,38,{"$f":"INDEX(TABULKA!$B$3:$B$52,$B152)","v":"Kemencik Zoltán"},{"$f":"INDEX(TABULKA!$B$3:$B$52,$C152)","v":"Slávik Igor"},2,5,0,3]
[7,15,40,{"$f":"INDEX(TABULKA!$B$3:$B$52,$B153)","v":"Jarka Pavel"},{"$f":"INDEX(TABULKA!$B$3:$B$52,$C153)","v":"Smorada Ján"},1,0,3,0]
[7,17,42,{"$f":"INDEX(TABULKA!$B$3:$B$52,$B154)","v":"Onofrej Ivan"},{"$f":"INDEX(TABULKA!$B$3:$B$52,$C154)","v":"Petríček Jaroslav"},5,5,1.5,1.5]
[7,19,44,{"$f":"INDEX(TABULKA!$B$3:$B$52,$B155)","v":"Hornák Filip"},{"$f":"INDEX(TABULKA!$B$3:$B$52,$C155)","v":"Pisarovič Erik"},0,3,0,3]
[7,21,46,{"$f":"INDEX(TABULKA!$B$3:$B$52,$B156)","v":"Medo Marián"},{"$f":"INDEX(TABULKA!$B$3:$B$52,$C156)","v":"Slávik Michal"},1,4,0,3]
[7,23,25,{"$f":"INDEX(TABULKA!$B$3:$B$52,$B157)","v":"Beňo Gabriel"},{"$f":"INDEX(TABULKA!$B$3:$B$52,$C157)","v":"Drahoš Matúš"},4,1,3]
[7,25,2,{"$f":"INDEX(TABULKA!$B$3:$B$52,$B158)","v":"Drahoš Matúš"},{"$f":"INDEX(TABULKA!$B$3:$B$52,$C158)","v":"Masarech Michal"},1,2,0,{"$f":"IF(OR($F158=\"-\",$G158=\"-\"),0,IF($F158<$G158,3,IF(AND($F158=0,$G158=0),1,IF($F158=$G158,1.5,0))))","v":3}]
[7,27,4,{"$f":"INDEX(TABULKA!$B$3:$B$52,$B159)","v":"Mrázik Juraj"},{"$f":"INDEX(TABULKA!$B$3:$B$52,$C159)","v":"Drančák David"},1,5,0,3]
[7,29,6,{"$f":"INDEX(TABULKA!$B$3:$B$52,$B160)","v":"Révay Dušan"},{"$f":"INDEX(TABULKA!$B$3:$B$52,$C160)","v":"Mašan Tomáš"},4,2,3,0]
[7,31,8,{"$f":"INDEX(TABULKA!$B$3:$B$52,$B161)","v":"Sýkora Jozef"},{"$f":"INDEX(TABULKA!$B$3:$B$52,$C161)","v":"Kochan Ladislav"},3,2,3,0]
[7,33,10,{"$f":"INDEX(TABULKA!$B$3:$B$52,$B162)","v":"Florek Tomáš"},{"$f":"INDEX(TABULKA!$B$3:$B$52,$C162)","v":"Kollár Mikuláš"},{"$f":"IF(ISBLANK(INDIRECT(ADDRESS(B162+2,$A162+2,1,1,\"tabulka\"),1)),\"-\",INDIRECT(ADDRESS(B162+2,$A162+2,1,1,\"tabulka\"),1))","v":0},{"$f":"IF(ISBLANK(INDIRECT(ADDRESS(C162+2,$A162+2,1,1,\"tabulka\"),1)),\"-\",INDIRECT(ADDRESS(C162+2,$A162+2,1,1,\"tabulka\"),1))","v":3},{"$f":"IF(OR($F162=\"-\",$G162=\"-\"),0,IF($F162>$G162,3,IF(AND($F162=0,$G162=0),1,IF($F162=$G162,1.5,0))))","v":0},3]
[7,35,12,{"$f":"INDEX(TABULKA!$B$3:$B$52,$B163)","v":"Petráš Martin"},{"$f":"INDEX(TABULKA!$B$3:$B$52,$C163)","v":"Šintál Adam"},4,1,3,0]
[7,37,14,{"$f":"INDEX(TABULKA!$B$3:$B$52,$B164)","v":"Mádr Tomáš"},{"$f":"INDEX(TABULKA!$B$3:$B$52,$C164)","v":"Buršák Roman"},1,1,1.5,1.5]
[7,39,16,{"$f":"INDEX(TABULKA!$B$3:$B$52,$B165)","v":"Petríček Stanislav"},{"$f":"INDEX(TABULKA!$B$3:$B$52,$C165)","v":"Kriho Marián"},1,2,0,3]
[7,41,18,{"$f":"INDEX(TABULKA!$B$3:$B$52,$B166)","v":"Schwarcz Roman"},{"$f":"INDEX(TABULKA!$B$3:$B$52,$C166)","v":"Smorada Marek"},2,1,3,0]
[7,43,20,{"$f":"INDEX(TABULKA!$B$3:$B$52,$B167)","v":"Michalka Marián"},{"$f":"INDEX(TABULKA!$B$3:$B$52,$C167)","v":"Mičo Martin"},0,2,0,3]
[7,45,22,{"$f":"INDEX(TABULKA!$B$3:$B$52,$B168)","v":"Popovič Milan"},{"$f":"INDEX(TABULKA!$B$3:$B$52,$C168)","v":"Belovič Radoslav"},1,2,0,3]
[7,47,24,{"$f":"INDEX(TABULKA!$B$3:$B$52,$B169)","v":"Medo Peter"},{"$f":"INDEX(TABULKA!$B$3:$B$52,$C169)","v":"Pecník Branislav"},1,1,1.5,1.5]
[8,1,6,{"$f":"INDEX(TABULKA!$B$3:$B$52,$B170)","v":"Šenigla Peter"},{"$f":"INDEX(TABULKA!$B$3:$B$52,$C170)","v":"Mašan Tomáš"},1,2,0,3]
[8,3,8,{"$f":"INDEX(TABULKA!$B$3:$B$52,$B171)","v":"Mešenec Martin"},{"$f":"INDEX(TABULKA!$B$3:$B$52,$C171)","v":"Kochan Ladislav"},1,3,0,3]
[8,5,10,{"$f":"INDEX(TABULKA!$B$3:$B$52,$B172)","v":"Vančík Juraj"},{"$f":"INDEX(TABULKA!$B$3:$B$52,$C172)","v":"Kollár Mikuláš"},2,0,3,0]
[8,7,12,{"$f":"INDEX(TABULKA!$B$3:$B$52,$B173)","v":"Daněk Michal"},{"$f":"INDEX(TABULKA!$B$3:$B$52,$C173)","v":"Šintál Adam"},1,0,3,0]
[8,9,14,{"$f":"INDEX(TABULKA!$B$3:$B$52,$B174)","v":"Spáčil Matej"},{"$f":"INDEX(TABULKA!$B$3:$B$52,$C174)","v":"Buršák Roman"},1,1,1.5,1.5]
[8,11,16,{"$f":"INDEX(TABULKA!$B$3:$B$52,$B175)","v":"Kuhajda Rastislav"},{"$f":"INDEX(TABULKA!$B$3:$B$52,$C175)","v":"Kriho Marián"},0,2,0,3]
[8,13,18,{"$f":"INDEX(TABULKA!$B$3:$B$52,$B176)","v":"Kemencik Zoltán"},{"$f":"INDEX(TABULKA!$B$3:$B$52,$C176)","v":"Smorada Marek"},2,2,1.5,1.5]
[8,15,20,{"$f":"INDEX(TABULKA!$B$3:$B$52,$B177)","v":"Jarka Pavel"},{"$f":"INDEX(TABULKA!$B$3:$B$52,$C177)","v":"Mičo Martin"},2,0,3,0]
[8,17,22,{"$f":"INDEX(TABULKA!$B$3:$B$52,$B178)","v":"Onofrej Ivan"},{"$f":"INDEX(TABULKA!$B$3:$B$52,$C178)","v":"Belovič Radoslav"},2,9,0,3]
[8,19,24,{"$f":"INDEX(TABULKA!$B$3:$B$52,$B179)","v":"Hornák Filip"},{"$f":"INDEX(TABULKA!$B$3:$B$52,$C179)","v":"Pecník Branislav"},0,2,0,3]
[8,21,26,{"$f":"INDEX(TABULKA!$B$3:$B$52,$B180)","v":"Medo Marián"},{"$f":"INDEX(TABULKA!$B$3:$B$52,$C180)","v":"Krnčan Juraj"},1,2,0,3]
[8,23,28,{"$f":"INDEX(TABULKA!$B$3:$B$52,$B181)","v":"Beňo Gabriel"},{"$f":"INDEX(TABULKA!$B$3:$B$52,$C181)","v":"Šenigla Vladimír"},5,1,3,0]
[8,25,30,{"$f":"INDEX(TABULKA!$B$3:$B$52,$B182)","v":"Drahoš Matúš"},{"$f":"INDEX(TABULKA!$B$3:$B$52,$C182)","v":"Borovica Jozef"},1,4,0,3]
[8,27,32,{"$f":"INDEX(TABULKA!$B$3:$B$52,$B183)","v":"Mrázik Juraj"},{"$f":"INDEX(TABULKA!$B$3:$B$52,$C183)","v":"Zrubec Róbert"},0,4,0,3]
[8,29,34,{"$f":"INDEX(TABULKA!$B$3:$B$52,$B184)","v":"Révay Dušan"},{"$f":"INDEX(TABULKA!$B$3:$B$52,$C184)","v":"Pavlíček Ľuboš"},3,4,0,3]
[8,31,36,{"$f":"INDEX(TABULKA!$B$3:$B$52,$B185)","v":"Sýkora Jozef"},{"$f":"INDEX(TABULKA!$B$3:$B$52,$C185)","v":"Hrivňák Ivan"},1,1,1.5,1.5]
[8,33,38,{"$f":"INDEX(TABULKA!$B$3:$B$52,$B186)","v":"Florek Tomáš"},{"$f":"INDEX(TABULKA!$B$3:$B$52,$C186)","v":"Slávik Igor"},2,7,0,3]
[8,35,40,{"$f":"INDEX(TABULKA!$B$3:$B$52,$B187)","v":"Petráš Martin"},{"$f":"INDEX(TABULKA!$B$3:$B$52,$C187)","v":"Smorada Ján"},2,2,1.5,1.5]
[8,37,42,{"$f":"INDEX(TABULKA!$B$3:$B$52,$B188)","v":"Mádr Tomáš"},{"$f":"INDEX(TABULKA!$B$3:$B$52,$C188)","v":"Petríček Jaroslav"},0,2,0,3]
[8,39,44,{"$f":"INDEX(TABULKA!$B$3:$B$52,$B189)","v":"Petríček Stanislav"},{"$f":"INDEX(TABULKA!$B$3:$B$52,$C189)","v":"Pisarovič Erik"},2,1,3,0]
[8,41,46,{"$f":"INDEX(TABULKA!$B$3:$B$52,$B190)","v":"Schwarcz Roman"},{"$f":"INDEX(TABULKA!$B$3:$B$52,$C190)","v":"Slávik Michal"},1,1,1.5,1.5]
[8,43,46,{"$f":"INDEX(TABULKA!$B$3:$B$52,$B191)","v":"Michalka Marián"},{"$f":"INDEX(TABULKA!$B$3:$B$52,$C191)","v":"Slávik Michal"},5,1,3]
[8,45,2,{"$f":"INDEX(TABULKA!$B$3:$B$52,$B192)","v":"Popovič Milan"},{"$f":"INDEX(TABULKA!$B$3:$B$52,$C192)","v":"Masarech Michal"},0,0,1,{"$f":"IF(OR($F192=\"-\",$G192=\"-\"),0,IF($F192<$G192,3,IF(AND($F192=0,$G192=0),1,IF($F192=$G192,1.5,0))))","v":1}]
[8,47,4,{"$f":"INDEX(TABULKA!$B$3:$B$52,$B193)","v":"Medo Peter"},{"$f":"INDEX(TABULKA!$B$3:$B$52,$C193)","v":"Drančák David"},0,1,0,{"$f":"IF(OR($F193=\"-\",$G193=\"-\"),0,IF($F193<$G193,3,IF(AND($F193=0,$G193=0),1,IF($F193=$G193,1.5,0))))","v":3}]

{"sheet":"BODY","index":5,"n_rows":52,"n_cols":14,"rows_kept":52,"cut":false,"hidden":false,"merged":[[0,2,0,10]]}
[null,null,"Počet bodov"]
["Pretekár","Meno",1,2,3,4,5,6,7,8,"počet bodov celkovo","počet výhier 3 b","počet remíz 1,5b","počet rýb"]
[42,{"$f":"IF(A3<=ZREBOVANIE!$M$1,VLOOKUP(A3,RYBARI!A:C,3,0),\"x\")","v":"Petríček Jaroslav"},{"$f":"SUMIFS(SÚBOJE!$H:$H,SÚBOJE!$A:$A,C$2,SÚBOJE!$B:$B,$A3)+SUMIFS(SÚBOJE!$I:$I,SÚBOJE!$A:$A,C$2,SÚBOJE!$C:$C,$A3)","v":3},{"$f":"SUMIFS(SÚBOJE!$H:$H,SÚBOJE!$A:$A,D$2,SÚBOJE!$B:$B,$A3)+SUMIFS(SÚBOJE!$I:$I,SÚBOJE!$A:$A,D$2,SÚBOJE!$C:$C,$A3)","v":1.5},{"$f":"SUMIFS(SÚBOJE!$H:$H,SÚBOJE!$A:$A,E$2,SÚBOJE!$B:$B,$A3)+SUMIFS(SÚBOJE!$I:$I,SÚBOJE!$A:$A,E$2,SÚBOJE!$C:$C,$A3)","v":3},{"$f":"SUMIFS(SÚBOJE!$H:$H,SÚBOJE!$A:$A,F$2,SÚBOJE!$B:$B,$A3)+SUMIFS(SÚBOJE!$I:$I,SÚBOJE!$A:$A,F$2,SÚBOJE!$C:$C,$A3)","v":3},{"$f":"SUMIFS(SÚBOJE!$H:$H,SÚBOJE!$A:$A,G$2,SÚBOJE!$B:$B,$A3)+SUMIFS(SÚBOJE!$I:$I,SÚBOJE!$A:$A,G$2,SÚBOJE!$C:$C,$A3)","v":3},{"$f":"SUMIFS(SÚBOJE!$H:$H,SÚBOJE!$A:$A,H$2,SÚBOJE!$B:$B,$A3)+SUMIFS(SÚBOJE!$I:$I,SÚBOJE!$A:$A,H$2,SÚBOJE!$C:$C,$A3)","v":3},{"$f":"SUMIFS(SÚBOJE!$H:$H,SÚBOJE!$A:$A,I$2,SÚBOJE!$B:$B,$A3)+SUMIFS(SÚBOJE!$I:$I,SÚBOJE!$A:$A,I$2,SÚBOJE!$C:$C,$A3)","v":1.5},{"$f":"SUMIFS(SÚBOJE!$H:$H,SÚBOJE!$A:$A,J$2,SÚBOJE!$B:$B,$A3)+SUMIFS(SÚBOJE!$I:$I,SÚBOJE!$A:$A,J$2,SÚBOJE!$C:$C,$A3)","v":3},{"$f":"SUM(C3:J3)","v":21},{"$f":"COUNTIFS(SÚBOJE!$B:$B,$A3,SÚBOJE!$H:$H,3)+COUNTIFS(SÚBOJE!$C:$C,$A3,SÚBOJE!$I:$I,3)","v":6},{"$f":"COUNTIFS(SÚBOJE!$B:$B,$A3,SÚBOJE!$H:$H,1.5)+COUNTIFS(SÚBOJE!$C:$C,$A3,SÚBOJE!$I:$I,1.5)","v":2},{"$f":"SUMIF(TABULKA!$A$3:$A$52,$A3,TABULKA!$K$3:$K$52)","v":27}]
[22,{"$f":"IF(A4<=ZREBOVANIE!$M$1,VLOOKUP(A4,RYBARI!A:C,3,0),\"x\")","v":"Belovič Radoslav"},{"$f":"SUMIFS(SÚBOJE!$H:$H,SÚBOJE!$A:$A,C$2,SÚBOJE!$B:$B,$A4)+SUMIFS(SÚBOJE!$I:$I,SÚBOJE!$A:$A,C$2,SÚBOJE!$C:$C,$A4)","v":3},{"$f":"SUMIFS(SÚBOJE!$H:$H,SÚBOJE!$A:$A,D$2,SÚBOJE!$B:$B,$A4)+SUMIFS(SÚBOJE!$I:$I,SÚBOJE!$A:$A,D$2,SÚBOJE!$C:$C,$A4)","v":3},{"$f":"SUMIFS(SÚBOJE!$H:$H,SÚBOJE!$A:$A,E$2,SÚBOJE!$B:$B,$A4)+SUMIFS(SÚBOJE!$I:$I,SÚBOJE!$A:$A,E$2,SÚBOJE!$C:$C,$A4)","v":3},{"$f":"SUMIFS(SÚBOJE!$H:$H,SÚBOJE!$A:$A,F$2,SÚBOJE!$B:$B,$A4)+SUMIFS(SÚBOJE!$I:$I,SÚBOJE!$A:$A,F$2,SÚBOJE!$C:$C,$A4)","v":3},{"$f":"SUMIFS(SÚBOJE!$H:$H,SÚBOJE!$A:$A,G$2,SÚBOJE!$B:$B,$A4)+SUMIFS(SÚBOJE!$I:$I,SÚBOJE!$A:$A,G$2,SÚBOJE!$C:$C,$A4)","v":1.5},{"$f":"SUMIFS(SÚBOJE!$H:$H,SÚBOJE!$A:$A,H$2,SÚBOJE!$B:$B,$A4)+SUMIFS(SÚBOJE!$I:$I,SÚBOJE!$A:$A,H$2,SÚBOJE!$C:$C,$A4)","v":0},{"$f":"SUMIFS(SÚBOJE!$H:$H,SÚBOJE!$A:$A,I$2,SÚBOJE!$B:$B,$A4)+SUMIFS(SÚBOJE!$I:$I,SÚBOJE!$A:$A,I$2,SÚBOJE!$C:$C,$A4)","v":3},{"$f":"SUMIFS(SÚBOJE!$H:$H,SÚBOJE!$A:$A,J$2,SÚBOJE!$B:$B,$A4)+SUMIFS(SÚBOJE!$I:$I,SÚBOJE!$A:$A,J$2,SÚBOJE!$C:$C,$A4)","v":3},19.5,{"$f":"COUNTIFS(SÚBOJE!$B:$B,$A4,SÚBOJE!$H:$H,3)+COUNTIFS(SÚBOJE!$C:$C,$A4,SÚBOJE!$I:$I,3)","v":6},{"$f":"COUNTIFS(SÚBOJE!$B:$B,$A4,SÚBOJE!$H:$H,1.5)+COUNTIFS(SÚBOJE!$C:$C,$A4,SÚBOJE!$I:$I,1.5)","v":1},{"$f":"SUMIF(TABULKA!$A$3:$A$52,$A4,TABULKA!$K$3:$K$52)","v":34}]
[16,{"$f":"IF(A5<=ZREBOVANIE!$M$1,VLOOKUP(A5,RYBARI!A:C,3,0),\"x\")","v":"Kriho Marián"},{"$f":"SUMIFS(SÚBOJE!$H:$H,SÚBOJE!$A:$A,C$2,SÚBOJE!$B:$B,$A5)+SUMIFS(SÚBOJE!$I:$I,SÚBOJE!$A:$A,C$2,SÚBOJE!$C:$C,$A5)","v":3},{"$f":"SUMIFS(SÚBOJE!$H:$H,SÚBOJE!$A:$A,D$2,SÚBOJE!$B:$B,$A5)+SUMIFS(SÚBOJE!$I:$I,SÚBOJE!$A:$A,D$2,SÚBOJE!$C:$C,$A5)","v":1.5},{"$f":"SUMIFS(SÚBOJE!$H:$H,SÚBOJE!$A:$A,E$2,SÚBOJE!$B:$B,$A5)+SUMIFS(SÚBOJE!$I:$I,SÚBOJE!$A:$A,E$2,SÚBOJE!$C:$C,$A5)","v":3},{"$f":"SUMIFS(SÚBOJE!$H:$H,SÚBOJE!$A:$A,F$2,SÚBOJE!$B:$B,$A5)+SUMIFS(SÚBOJE!$I:$I,SÚBOJE!$A:$A,F$2,SÚBOJE!$C:$C,$A5)","v":3},{"$f":"SUMIFS(SÚBOJE!$H:$H,SÚBOJE!$A:$A,G$2,SÚBOJE!$B:$B,$A5)+SUMIFS(SÚBOJE!$I:$I,SÚBOJE!$A:$A,G$2,SÚBOJE!$C:$C,$A5)","v":0},{"$f":"SUMIFS(SÚBOJE!$H:$H,SÚBOJE!$A:$A,H$2,SÚBOJE!$B:$B,$A5)+SUMIFS(SÚBOJE!$I:$I,SÚBOJE!$A:$A,H$2,SÚBOJE!$C:$C,$A5)","v":3},{"$f":"SUMIFS(SÚBOJE!$H:$H,SÚBOJE!$A:$A,I$2,SÚBOJE!$B:$B,$A5)+SUMIFS(SÚBOJE!$I:$I,SÚBOJE!$A:$A,I$2,SÚBOJE!$C:$C,$A5)","v":3},{"$f":"SUMIFS(SÚBOJE!$H:$H,SÚBOJE!$A:$A,J$2,SÚBOJE!$B:$B,$A5)+SUMIFS(SÚBOJE!$I:$I,SÚBOJE!$A:$A,J$2,SÚBOJE!$C:$C,$A5)","v":3},19.5,{"$f":"COUNTIFS(SÚBOJE!$B:$B,$A5,SÚBOJE!$H:$H,3)+COUNTIFS(SÚBOJE!$C:$C,$A5,SÚBOJE!$I:$I,3)","v":6},{"$f":"COUNTIFS(SÚBOJE!$B:$B,$A5,SÚBOJE!$H:$H,1.5)+COUNTIFS(SÚBOJE!$C:$C,$A5,SÚBOJE!$I:$I,1.5)","v":1},{"$f":"SUMIF(TABULKA!$A$3:$A$52,$A5,TABULKA!$K$3:$K$52)","v":24}]
[6,{"$f":"IF(A6<=ZREBOVANIE!$M$1,VLOOKUP(A6,RYBARI!A:C,3,0),\"x\")","v":"Mašan Tomáš"},{"$f":"SUMIFS(SÚBOJE!$H:$H,SÚBOJE!$A:$A,C$2,SÚBOJE!$B:$B,$A6)+SUMIFS(SÚBOJE!$I:$I,SÚBOJE!$A:$A,C$2,SÚBOJE!$C:$C,$A6)","v":3},{"$f":"SUMIFS(SÚBOJE!$H:$H,SÚBOJE!$A:$A,D$2,SÚBOJE!$B:$B,$A6)+SUMIFS(SÚBOJE!$I:$I,SÚBOJE!$A:$A,D$2,SÚBOJE!$C:$C,$A6)","v":1.5},{"$f":"SUMIFS(SÚBOJE!$H:$H,SÚBOJE!$A:$A,E$2,SÚBOJE!$B:$B,$A6)+SUMIFS(SÚBOJE!$I:$I,SÚBOJE!$A:$A,E$2,SÚBOJE!$C:$C,$A6)","v":3},{"$f":"SUMIFS(SÚBOJE!$H:$H,SÚBOJE!$A:$A,F$2,SÚBOJE!$B:$B,$A6)+SUMIFS(SÚBOJE!$I:$I,SÚBOJE!$A:$A,F$2,SÚBOJE!$C:$C,$A6)","v":3},{"$f":"SUMIFS(SÚBOJE!$H:$H,SÚBOJE!$A:$A,G$2,SÚBOJE!$B:$B,$A6)+SUMIFS(SÚBOJE!$I:$I,SÚBOJE!$A:$A,G$2,SÚBOJE!$C:$C,$A6)","v":3},{"$f":"SUMIFS(SÚBOJE!$H:$H,SÚBOJE!$A:$A,H$2,SÚBOJE!$B:$B,$A6)+SUMIFS(SÚBOJE!$I:$I,SÚBOJE!$A:$A,H$2,SÚBOJE!$C:$C,$A6)","v":3},{"$f":"SUMIFS(SÚBOJE!$H:$H,SÚBOJE!$A:$A,I$2,SÚBOJE!$B:$B,$A6)+SUMIFS(SÚBOJE!$I:$I,SÚBOJE!$A:$A,I$2,SÚBOJE!$C:$C,$A6)","v":0},{"$f":"SUMIFS(SÚBOJE!$H:$H,SÚBOJE!$A:$A,J$2,SÚBOJE!$B:$B,$A6)+SUMIFS(SÚBOJE!$I:$I,SÚBOJE!$A:$A,J$2,SÚBOJE!$C:$C,$A6)","v":3},19.5,{"$f":"COUNTIFS(SÚBOJE!$B:$B,$A6,SÚBOJE!$H:$H,3)+COUNTIFS(SÚBOJE!$C:$C,$A6,SÚBOJE!$I:$I,3)","v":6},{"$f":"COUNTIFS(SÚBOJE!$B:$B,$A6,SÚBOJE!$H:$H,1.5)+COUNTIFS(SÚBOJE!$C:$C,$A6,SÚBOJE!$I:$I,1.5)","v":1},{"$f":"SUMIF(TABULKA!$A$3:$A$52,$A6,TABULKA!$K$3:$K$52)","v":22}]
[7,{"$f":"IF(A7<=ZREBOVANIE!$M$1,VLOOKUP(A7,RYBARI!A:C,3,0),\"x\")","v":"Daněk Michal"},{"$f":"SUMIFS(SÚBOJE!$H:$H,SÚBOJE!$A:$A,C$2,SÚBOJE!$B:$B,$A7)+SUMIFS(SÚBOJE!$I:$I,SÚBOJE!$A:$A,C$2,SÚBOJE!$C:$C,$A7)","v":0},{"$f":"SUMIFS(SÚBOJE!$H:$H,SÚBOJE!$A:$A,D$2,SÚBOJE!$B:$B,$A7)+SUMIFS(SÚBOJE!$I:$I,SÚBOJE!$A:$A,D$2,SÚBOJE!$C:$C,$A7)","v":3},{"$f":"SUMIFS(SÚBOJE!$H:$H,SÚBOJE!$A:$A,E$2,SÚBOJE!$B:$B,$A7)+SUMIFS(SÚBOJE!$I:$I,SÚBOJE!$A:$A,E$2,SÚBOJE!$C:$C,$A7)","v":0},{"$f":"SUMIFS(SÚBOJE!$H:$H,SÚBOJE!$A:$A,F$2,SÚBOJE!$B:$B,$A7)+SUMIFS(SÚBOJE!$I:$I,SÚBOJE!$A:$A,F$2,SÚBOJE!$C:$C,$A7)","v":3},{"$f":"SUMIFS(SÚBOJE!$H:$H,SÚBOJE!$A:$A,G$2,SÚBOJE!$B:$B,$A7)+SUMIFS(SÚBOJE!$I:$I,SÚBOJE!$A:$A,G$2,SÚBOJE!$C:$C,$A7)","v":3},{"$f":"SUMIFS(SÚBOJE!$H:$H,SÚBOJE!$A:$A,H$2,SÚBOJE!$B:$B,$A7)+SUMIFS(SÚBOJE!$I:$I,SÚBOJE!$A:$A,H$2,SÚBOJE!$C:$C,$A7)","v":3},{"$f":"SUMIFS(SÚBOJE!$H:$H,SÚBOJE!$A:$A,I$2,SÚBOJE!$B:$B,$A7)+SUMIFS(SÚBOJE!$I:$I,SÚBOJE!$A:$A,I$2,SÚBOJE!$C:$C,$A7)","v":3},{"$f":"SUMIFS(SÚBOJE!$H:$H,SÚBOJE!$A:$A,J$2,SÚBOJE!$B:$B,$A7)+SUMIFS(SÚBOJE!$I:$I,SÚBOJE!$A:$A,J$2,SÚBOJE!$C:$C,$A7)","v":3},18,{"$f":"COUNTIFS(SÚBOJE!$B:$B,$A7,SÚBOJE!$H:$H,3)+COUNTIFS(SÚBOJE!$C:$C,$A7,SÚBOJE!$I:$I,3)","v":6},{"$f":"COUNTIFS(SÚBOJE!$B:$B,$A7,SÚBOJE!$H:$H,1.5)+COUNTIFS(SÚBOJE!$C:$C,$A7,SÚBOJE!$I:$I,1.5)","v":0},{"$f":"SUMIF(TABULKA!$A$3:$A$52,$A7,TABULKA!$K$3:$K$52)","v":26}]
[20,{"$f":"IF(A8<=ZREBOVANIE!$M$1,VLOOKUP(A8,RYBARI!A:C,3,0),\"x\")","v":"Mičo Martin"},{"$f":"SUMIFS(SÚBOJE!$H:$H,SÚBOJE!$A:$A,C$2,SÚBOJE!$B:$B,$A8)+SUMIFS(SÚBOJE!$I:$I,SÚBOJE!$A:$A,C$2,SÚBOJE!$C:$C,$A8)","v":3},{"$f":"SUMIFS(SÚBOJE!$H:$H,SÚBOJE!$A:$A,D$2,SÚBOJE!$B:$B,$A8)+SUMIFS(SÚBOJE!$I:$I,SÚBOJE!$A:$A,D$2,SÚBOJE!$C:$C,$A8)","v":3},{"$f":"SUMIFS(SÚBOJE!$H:$H,SÚBOJE!$A:$A,E$2,SÚBOJE!$B:$B,$A8)+SUMIFS(SÚBOJE!$I:$I,SÚBOJE!$A:$A,E$2,SÚBOJE!$C:$C,$A8)","v":3},{"$f":"SUMIFS(SÚBOJE!$H:$H,SÚBOJE!$A:$A,F$2,SÚBOJE!$B:$B,$A8)+SUMIFS(SÚBOJE!$I:$I,SÚBOJE!$A:$A,F$2,SÚBOJE!$C:$C,$A8)","v":3},{"$f":"SUMIFS(SÚBOJE!$H:$H,SÚBOJE!$A:$A,G$2,SÚBOJE!$B:$B,$A8)+SUMIFS(SÚBOJE!$I:$I,SÚBOJE!$A:$A,G$2,SÚBOJE!$C:$C,$A8)","v":0},{"$f":"SUMIFS(SÚBOJE!$H:$H,SÚBOJE!$A:$A,H$2,SÚBOJE!$B:$B,$A8)+SUMIFS(SÚBOJE!$I:$I,SÚBOJE!$A:$A,H$2,SÚBOJE!$C:$C,$A8)","v":3},{"$f":"SUMIFS(SÚBOJE!$H:$H,SÚBOJE!$A:$A,I$2,SÚBOJE!$B:$B,$A8)+SUMIFS(SÚBOJE!$I:$I,SÚBOJE!$A:$A,I$2,SÚBOJE!$C:$C,$A8)","v":3},{"$f":"SUMIFS(SÚBOJE!$H:$H,SÚBOJE!$A:$A,J$2,SÚBOJE!$B:$B,$A8)+SUMIFS(SÚBOJE!$I:$I,SÚBOJE!$A:$A,J$2,SÚBOJE!$C:$C,$A8)","v":0},18,{"$f":"COUNTIFS(SÚBOJE!$B:$B,$A8,SÚBOJE!$H:$H,3)+COUNTIFS(SÚBOJE!$C:$C,$A8,SÚBOJE!$I:$I,3)","v":6},{"$f":"COUNTIFS(SÚBOJE!$B:$B,$A8,SÚBOJE!$H:$H,1.5)+COUNTIFS(SÚBOJE!$C:$C,$A8,SÚBOJE!$I:$I,1.5)","v":0},{"$f":"SUMIF(TABULKA!$A$3:$A$52,$A8,TABULKA!$K$3:$K$52)","v":24}]
[32,{"$f":"IF(A9<=ZREBOVANIE!$M$1,VLOOKUP(A9,RYBARI!A:C,3,0),\"x\")","v":"Zrubec Róbert"},{"$f":"SUMIFS(SÚBOJE!$H:$H,SÚBOJE!$A:$A,C$2,SÚBOJE!$B:$B,$A9)+SUMIFS(SÚBOJE!$I:$I,SÚBOJE!$A:$A,C$2,SÚBOJE!$C:$C,$A9)","v":3},{"$f":"SUMIFS(SÚBOJE!$H:$H,SÚBOJE!$A:$A,D$2,SÚBOJE!$B:$B,$A9)+SUMIFS(SÚBOJE!$I:$I,SÚBOJE!$A:$A,D$2,SÚBOJE!$C:$C,$A9)","v":3},{"$f":"SUMIFS(SÚBOJE!$H:$H,SÚBOJE!$A:$A,E$2,SÚBOJE!$B:$B,$A9)+SUMIFS(SÚBOJE!$I:$I,SÚBOJE!$A:$A,E$2,SÚBOJE!$C:$C,$A9)","v":3},{"$f":"SUMIFS(SÚBOJE!$H:$H,SÚBOJE!$A:$A,F$2,SÚBOJE!$B:$B,$A9)+SUMIFS(SÚBOJE!$I:$I,SÚBOJE!$A:$A,F$2,SÚBOJE!$C:$C,$A9)","v":3},{"$f":"SUMIFS(SÚBOJE!$H:$H,SÚBOJE!$A:$A,G$2,SÚBOJE!$B:$B,$A9)+SUMIFS(SÚBOJE!$I:$I,SÚBOJE!$A:$A,G$2,SÚBOJE!$C:$C,$A9)","v":3},{"$f":"SUMIFS(SÚBOJE!$H:$H,SÚBOJE!$A:$A,H$2,SÚBOJE!$B:$B,$A9)+SUMIFS(SÚBOJE!$I:$I,SÚBOJE!$A:$A,H$2,SÚBOJE!$C:$C,$A9)","v":0},{"$f":"SUMIFS(SÚBOJE!$H:$H,SÚBOJE!$A:$A,I$2,SÚBOJE!$B:$B,$A9)+SUMIFS(SÚBOJE!$I:$I,SÚBOJE!$A:$A,I$2,SÚBOJE!$C:$C,$A9)","v":0},{"$f":"SUMIFS(SÚBOJE!$H:$H,SÚBOJE!$A:$A,J$2,SÚBOJE!$B:$B,$A9)+SUMIFS(SÚBOJE!$I:$I,SÚBOJE!$A:$A,J$2,SÚBOJE!$C:$C,$A9)","v":3},18,{"$f":"COUNTIFS(SÚBOJE!$B:$B,$A9,SÚBOJE!$H:$H,3)+COUNTIFS(SÚBOJE!$C:$C,$A9,SÚBOJE!$I:$I,3)","v":6},{"$f":"COUNTIFS(SÚBOJE!$B:$B,$A9,SÚBOJE!$H:$H,1.5)+COUNTIFS(SÚBOJE!$C:$C,$A9,SÚBOJE!$I:$I,1.5)","v":0},{"$f":"SUMIF(TABULKA!$A$3:$A$52,$A9,TABULKA!$K$3:$K$52)","v":24}]
[30,{"$f":"IF(A10<=ZREBOVANIE!$M$1,VLOOKUP(A10,RYBARI!A:C,3,0),\"x\")","v":"Borovica Jozef"},{"$f":"SUMIFS(SÚBOJE!$H:$H,SÚBOJE!$A:$A,C$2,SÚBOJE!$B:$B,$A10)+SUMIFS(SÚBOJE!$I:$I,SÚBOJE!$A:$A,C$2,SÚBOJE!$C:$C,$A10)","v":3},{"$f":"SUMIFS(SÚBOJE!$H:$H,SÚBOJE!$A:$A,D$2,SÚBOJE!$B:$B,$A10)+SUMIFS(SÚBOJE!$I:$I,SÚBOJE!$A:$A,D$2,SÚBOJE!$C:$C,$A10)","v":3},{"$f":"SUMIFS(SÚBOJE!$H:$H,SÚBOJE!$A:$A,E$2,SÚBOJE!$B:$B,$A10)+SUMIFS(SÚBOJE!$I:$I,SÚBOJE!$A:$A,E$2,SÚBOJE!$C:$C,$A10)","v":3},{"$f":"SUMIFS(SÚBOJE!$H:$H,SÚBOJE!$A:$A,F$2,SÚBOJE!$B:$B,$A10)+SUMIFS(SÚBOJE!$I:$I,SÚBOJE!$A:$A,F$2,SÚBOJE!$C:$C,$A10)","v":3},{"$f":"SUMIFS(SÚBOJE!$H:$H,SÚBOJE!$A:$A,G$2,SÚBOJE!$B:$B,$A10)+SUMIFS(SÚBOJE!$I:$I,SÚBOJE!$A:$A,G$2,SÚBOJE!$C:$C,$A10)","v":0},{"$f":"SUMIFS(SÚBOJE!$H:$H,SÚBOJE!$A:$A,H$2,SÚBOJE!$B:$B,$A10)+SUMIFS(SÚBOJE!$I:$I,SÚBOJE!$A:$A,H$2,SÚBOJE!$C:$C,$A10)","v":1},{"$f":"SUMIFS(SÚBOJE!$H:$H,SÚBOJE!$A:$A,I$2,SÚBOJE!$B:$B,$A10)+SUMIFS(SÚBOJE!$I:$I,SÚBOJE!$A:$A,I$2,SÚBOJE!$C:$C,$A10)","v":1.5},{"$f":"SUMIFS(SÚBOJE!$H:$H,SÚBOJE!$A:$A,J$2,SÚBOJE!$B:$B,$A10)+SUMIFS(SÚBOJE!$I:$I,SÚBOJE!$A:$A,J$2,SÚBOJE!$C:$C,$A10)","v":3},17.5,{"$f":"COUNTIFS(SÚBOJE!$B:$B,$A10,SÚBOJE!$H:$H,3)+COUNTIFS(SÚBOJE!$C:$C,$A10,SÚBOJE!$I:$I,3)","v":5},{"$f":"COUNTIFS(SÚBOJE!$B:$B,$A10,SÚBOJE!$H:$H,1.5)+COUNTIFS(SÚBOJE!$C:$C,$A10,SÚBOJE!$I:$I,1.5)","v":1},{"$f":"SUMIF(TABULKA!$A$3:$A$52,$A10,TABULKA!$K$3:$K$52)","v":19}]
[38,{"$f":"IF(A11<=ZREBOVANIE!$M$1,VLOOKUP(A11,RYBARI!A:C,3,0),\"x\")","v":"Slávik Igor"},{"$f":"SUMIFS(SÚBOJE!$H:$H,SÚBOJE!$A:$A,C$2,SÚBOJE!$B:$B,$A11)+SUMIFS(SÚBOJE!$I:$I,SÚBOJE!$A:$A,C$2,SÚBOJE!$C:$C,$A11)","v":3},{"$f":"SUMIFS(SÚBOJE!$H:$H,SÚBOJE!$A:$A,D$2,SÚBOJE!$B:$B,$A11)+SUMIFS(SÚBOJE!$I:$I,SÚBOJE!$A:$A,D$2,SÚBOJE!$C:$C,$A11)","v":0},{"$f":"SUMIFS(SÚBOJE!$H:$H,SÚBOJE!$A:$A,E$2,SÚBOJE!$B:$B,$A11)+SUMIFS(SÚBOJE!$I:$I,SÚBOJE!$A:$A,E$2,SÚBOJE!$C:$C,$A11)","v":3},{"$f":"SUMIFS(SÚBOJE!$H:$H,SÚBOJE!$A:$A,F$2,SÚBOJE!$B:$B,$A11)+SUMIFS(SÚBOJE!$I:$I,SÚBOJE!$A:$A,F$2,SÚBOJE!$C:$C,$A11)","v":1.5},{"$f":"SUMIFS(SÚBOJE!$H:$H,SÚBOJE!$A:$A,G$2,SÚBOJE!$B:$B,$A11)+SUMIFS(SÚBOJE!$I:$I,SÚBOJE!$A:$A,G$2,SÚBOJE!$C:$C,$A11)","v":3},{"$f":"SUMIFS(SÚBOJE!$H:$H,SÚBOJE!$A:$A,H$2,SÚBOJE!$B:$B,$A11)+SUMIFS(SÚBOJE!$I:$I,SÚBOJE!$A:$A,H$2,SÚBOJE!$C:$C,$A11)","v":0},{"$f":"SUMIFS(SÚBOJE!$H:$H,SÚBOJE!$A:$A,I$2,SÚBOJE!$B:$B,$A11)+SUMIFS(SÚBOJE!$I:$I,SÚBOJE!$A:$A,I$2,SÚBOJE!$C:$C,$A11)","v":3},{"$f":"SUMIFS(SÚBOJE!$H:$H,SÚBOJE!$A:$A,J$2,SÚBOJE!$B:$B,$A11)+SUMIFS(SÚBOJE!$I:$I,SÚBOJE!$A:$A,J$2,SÚBOJE!$C:$C,$A11)","v":3},16.5,{"$f":"COUNTIFS(SÚBOJE!$B:$B,$A11,SÚBOJE!$H:$H,3)+COUNTIFS(SÚBOJE!$C:$C,$A11,SÚBOJE!$I:$I,3)","v":5},{"$f":"COUNTIFS(SÚBOJE!$B:$B,$A11,SÚBOJE!$H:$H,1.5)+COUNTIFS(SÚBOJE!$C:$C,$A11,SÚBOJE!$I:$I,1.5)","v":1},{"$f":"SUMIF(TABULKA!$A$3:$A$52,$A11,TABULKA!$K$3:$K$52)","v":26}]
[18,{"$f":"IF(A12<=ZREBOVANIE!$M$1,VLOOKUP(A12,RYBARI!A:C,3,0),\"x\")","v":"Smorada Marek"},{"$f":"SUMIFS(SÚBOJE!$H:$H,SÚBOJE!$A:$A,C$2,SÚBOJE!$B:$B,$A12)+SUMIFS(SÚBOJE!$I:$I,SÚBOJE!$A:$A,C$2,SÚBOJE!$C:$C,$A12)","v":3},{"$f":"SUMIFS(SÚBOJE!$H:$H,SÚBOJE!$A:$A,D$2,SÚBOJE!$B:$B,$A12)+SUMIFS(SÚBOJE!$I:$I,SÚBOJE!$A:$A,D$2,SÚBOJE!$C:$C,$A12)","v":3},{"$f":"SUMIFS(SÚBOJE!$H:$H,SÚBOJE!$A:$A,E$2,SÚBOJE!$B:$B,$A12)+SUMIFS(SÚBOJE!$I:$I,SÚBOJE!$A:$A,E$2,SÚBOJE!$C:$C,$A12)","v":3},{"$f":"SUMIFS(SÚBOJE!$H:$H,SÚBOJE!$A:$A,F$2,SÚBOJE!$B:$B,$A12)+SUMIFS(SÚBOJE!$I:$I,SÚBOJE!$A:$A,F$2,SÚBOJE!$C:$C,$A12)","v":3},{"$f":"SUMIFS(SÚBOJE!$H:$H,SÚBOJE!$A:$A,G$2,SÚBOJE!$B:$B,$A12)+SUMIFS(SÚBOJE!$I:$I,SÚBOJE!$A:$A,G$2,SÚBOJE!$C:$C,$A12)","v":0},{"$f":"SUMIFS(SÚBOJE!$H:$H,SÚBOJE!$A:$A,H$2,SÚBOJE!$B:$B,$A12)+SUMIFS(SÚBOJE!$I:$I,SÚBOJE!$A:$A,H$2,SÚBOJE!$C:$C,$A12)","v":3},{"$f":"SUMIFS(SÚBOJE!$H:$H,SÚBOJE!$A:$A,I$2,SÚBOJE!$B:$B,$A12)+SUMIFS(SÚBOJE!$I:$I,SÚBOJE!$A:$A,I$2,SÚBOJE!$C:$C,$A12)","v":0},{"$f":"SUMIFS(SÚBOJE!$H:$H,SÚBOJE!$A:$A,J$2,SÚBOJE!$B:$B,$A12)+SUMIFS(SÚBOJE!$I:$I,SÚBOJE!$A:$A,J$2,SÚBOJE!$C:$C,$A12)","v":1.5},16.5,{"$f":"COUNTIFS(SÚBOJE!$B:$B,$A12,SÚBOJE!$H:$H,3)+COUNTIFS(SÚBOJE!$C:$C,$A12,SÚBOJE!$I:$I,3)","v":5},{"$f":"COUNTIFS(SÚBOJE!$B:$B,$A12,SÚBOJE!$H:$H,1.5)+COUNTIFS(SÚBOJE!$C:$C,$A12,SÚBOJE!$I:$I,1.5)","v":1},{"$f":"SUMIF(TABULKA!$A$3:$A$52,$A12,TABULKA!$K$3:$K$52)","v":21}]
[46,{"$f":"IF(A13<=ZREBOVANIE!$M$1,VLOOKUP(A13,RYBARI!A:C,3,0),\"x\")","v":"Slávik Michal"},{"$f":"SUMIFS(SÚBOJE!$H:$H,SÚBOJE!$A:$A,C$2,SÚBOJE!$B:$B,$A13)+SUMIFS(SÚBOJE!$I:$I,SÚBOJE!$A:$A,C$2,SÚBOJE!$C:$C,$A13)","v":0},{"$f":"SUMIFS(SÚBOJE!$H:$H,SÚBOJE!$A:$A,D$2,SÚBOJE!$B:$B,$A13)+SUMIFS(SÚBOJE!$I:$I,SÚBOJE!$A:$A,D$2,SÚBOJE!$C:$C,$A13)","v":3},{"$f":"SUMIFS(SÚBOJE!$H:$H,SÚBOJE!$A:$A,E$2,SÚBOJE!$B:$B,$A13)+SUMIFS(SÚBOJE!$I:$I,SÚBOJE!$A:$A,E$2,SÚBOJE!$C:$C,$A13)","v":3},{"$f":"SUMIFS(SÚBOJE!$H:$H,SÚBOJE!$A:$A,F$2,SÚBOJE!$B:$B,$A13)+SUMIFS(SÚBOJE!$I:$I,SÚBOJE!$A:$A,F$2,SÚBOJE!$C:$C,$A13)","v":3},{"$f":"SUMIFS(SÚBOJE!$H:$H,SÚBOJE!$A:$A,G$2,SÚBOJE!$B:$B,$A13)+SUMIFS(SÚBOJE!$I:$I,SÚBOJE!$A:$A,G$2,SÚBOJE!$C:$C,$A13)","v":0},{"$f":"SUMIFS(SÚBOJE!$H:$H,SÚBOJE!$A:$A,H$2,SÚBOJE!$B:$B,$A13)+SUMIFS(SÚBOJE!$I:$I,SÚBOJE!$A:$A,H$2,SÚBOJE!$C:$C,$A13)","v":3},{"$f":"SUMIFS(SÚBOJE!$H:$H,SÚBOJE!$A:$A,I$2,SÚBOJE!$B:$B,$A13)+SUMIFS(SÚBOJE!$I:$I,SÚBOJE!$A:$A,I$2,SÚBOJE!$C:$C,$A13)","v":3},{"$f":"SUMIFS(SÚBOJE!$H:$H,SÚBOJE!$A:$A,J$2,SÚBOJE!$B:$B,$A13)+SUMIFS(SÚBOJE!$I:$I,SÚBOJE!$A:$A,J$2,SÚBOJE!$C:$C,$A13)","v":1.5},16.5,{"$f":"COUNTIFS(SÚBOJE!$B:$B,$A13,SÚBOJE!$H:$H,3)+COUNTIFS(SÚBOJE!$C:$C,$A13,SÚBOJE!$I:$I,3)","v":5},{"$f":"COUNTIFS(SÚBOJE!$B:$B,$A13,SÚBOJE!$H:$H,1.5)+COUNTIFS(SÚBOJE!$C:$C,$A13,SÚBOJE!$I:$I,1.5)","v":1},{"$f":"SUMIF(TABULKA!$A$3:$A$52,$A13,TABULKA!$K$3:$K$52)","v":20}]
[15,{"$f":"IF(A14<=ZREBOVANIE!$M$1,VLOOKUP(A14,RYBARI!A:C,3,0),\"x\")","v":"Jarka Pavel"},{"$f":"SUMIFS(SÚBOJE!$H:$H,SÚBOJE!$A:$A,C$2,SÚBOJE!$B:$B,$A14)+SUMIFS(SÚBOJE!$I:$I,SÚBOJE!$A:$A,C$2,SÚBOJE!$C:$C,$A14)","v":0},{"$f":"SUMIFS(SÚBOJE!$H:$H,SÚBOJE!$A:$A,D$2,SÚBOJE!$B:$B,$A14)+SUMIFS(SÚBOJE!$I:$I,SÚBOJE!$A:$A,D$2,SÚBOJE!$C:$C,$A14)","v":3},{"$f":"SUMIFS(SÚBOJE!$H:$H,SÚBOJE!$A:$A,E$2,SÚBOJE!$B:$B,$A14)+SUMIFS(SÚBOJE!$I:$I,SÚBOJE!$A:$A,E$2,SÚBOJE!$C:$C,$A14)","v":3},{"$f":"SUMIFS(SÚBOJE!$H:$H,SÚBOJE!$A:$A,F$2,SÚBOJE!$B:$B,$A14)+SUMIFS(SÚBOJE!$I:$I,SÚBOJE!$A:$A,F$2,SÚBOJE!$C:$C,$A14)","v":3},{"$f":"SUMIFS(SÚBOJE!$H:$H,SÚBOJE!$A:$A,G$2,SÚBOJE!$B:$B,$A14)+SUMIFS(SÚBOJE!$I:$I,SÚBOJE!$A:$A,G$2,SÚBOJE!$C:$C,$A14)","v":0},{"$f":"SUMIFS(SÚBOJE!$H:$H,SÚBOJE!$A:$A,H$2,SÚBOJE!$B:$B,$A14)+SUMIFS(SÚBOJE!$I:$I,SÚBOJE!$A:$A,H$2,SÚBOJE!$C:$C,$A14)","v":1.5},{"$f":"SUMIFS(SÚBOJE!$H:$H,SÚBOJE!$A:$A,I$2,SÚBOJE!$B:$B,$A14)+SUMIFS(SÚBOJE!$I:$I,SÚBOJE!$A:$A,I$2,SÚBOJE!$C:$C,$A14)","v":3},{"$f":"SUMIFS(SÚBOJE!$H:$H,SÚBOJE!$A:$A,J$2,SÚBOJE!$B:$B,$A14)+SUMIFS(SÚBOJE!$I:$I,SÚBOJE!$A:$A,J$2,SÚBOJE!$C:$C,$A14)","v":3},16.5,{"$f":"COUNTIFS(SÚBOJE!$B:$B,$A14,SÚBOJE!$H:$H,3)+COUNTIFS(SÚBOJE!$C:$C,$A14,SÚBOJE!$I:$I,3)","v":5},{"$f":"COUNTIFS(SÚBOJE!$B:$B,$A14,SÚBOJE!$H:$H,1.5)+COUNTIFS(SÚBOJE!$C:$C,$A14,SÚBOJE!$I:$I,1.5)","v":1},{"$f":"SUMIF(TABULKA!$A$3:$A$52,$A14,TABULKA!$K$3:$K$52)","v":15}]
[11,{"$f":"IF(A15<=ZREBOVANIE!$M$1,VLOOKUP(A15,RYBARI!A:C,3,0),\"x\")","v":"Kuhajda Rastislav"},{"$f":"SUMIFS(SÚBOJE!$H:$H,SÚBOJE!$A:$A,C$2,SÚBOJE!$B:$B,$A15)+SUMIFS(SÚBOJE!$I:$I,SÚBOJE!$A:$A,C$2,SÚBOJE!$C:$C,$A15)","v":1.5},{"$f":"SUMIFS(SÚBOJE!$H:$H,SÚBOJE!$A:$A,D$2,SÚBOJE!$B:$B,$A15)+SUMIFS(SÚBOJE!$I:$I,SÚBOJE!$A:$A,D$2,SÚBOJE!$C:$C,$A15)","v":3},{"$f":"SUMIFS(SÚBOJE!$H:$H,SÚBOJE!$A:$A,E$2,SÚBOJE!$B:$B,$A15)+SUMIFS(SÚBOJE!$I:$I,SÚBOJE!$A:$A,E$2,SÚBOJE!$C:$C,$A15)","v":0},{"$f":"SUMIFS(SÚBOJE!$H:$H,SÚBOJE!$A:$A,F$2,SÚBOJE!$B:$B,$A15)+SUMIFS(SÚBOJE!$I:$I,SÚBOJE!$A:$A,F$2,SÚBOJE!$C:$C,$A15)","v":3},{"$f":"SUMIFS(SÚBOJE!$H:$H,SÚBOJE!$A:$A,G$2,SÚBOJE!$B:$B,$A15)+SUMIFS(SÚBOJE!$I:$I,SÚBOJE!$A:$A,G$2,SÚBOJE!$C:$C,$A15)","v":3},{"$f":"SUMIFS(SÚBOJE!$H:$H,SÚBOJE!$A:$A,H$2,SÚBOJE!$B:$B,$A15)+SUMIFS(SÚBOJE!$I:$I,SÚBOJE!$A:$A,H$2,SÚBOJE!$C:$C,$A15)","v":3},{"$f":"SUMIFS(SÚBOJE!$H:$H,SÚBOJE!$A:$A,I$2,SÚBOJE!$B:$B,$A15)+SUMIFS(SÚBOJE!$I:$I,SÚBOJE!$A:$A,I$2,SÚBOJE!$C:$C,$A15)","v":3},{"$f":"SUMIFS(SÚBOJE!$H:$H,SÚBOJE!$A:$A,J$2,SÚBOJE!$B:$B,$A15)+SUMIFS(SÚBOJE!$I:$I,SÚBOJE!$A:$A,J$2,SÚBOJE!$C:$C,$A15)","v":0},16.5,{"$f":"COUNTIFS(SÚBOJE!$B:$B,$A15,SÚBOJE!$H:$H,3)+COUNTIFS(SÚBOJE!$C:$C,$A15,SÚBOJE!$I:$I,3)","v":5},{"$f":"COUNTIFS(SÚBOJE!$B:$B,$A15,SÚBOJE!$H:$H,1.5)+COUNTIFS(SÚBOJE!$C:$C,$A15,SÚBOJE!$I:$I,1.5)","v":1},{"$f":"SUMIF(TABULKA!$A$3:$A$52,$A15,TABULKA!$K$3:$K$52)","v":14}]
[35,{"$f":"IF(A16<=ZREBOVANIE!$M$1,VLOOKUP(A16,RYBARI!A:C,3,0),\"x\")","v":"Petráš Martin"},{"$f":"SUMIFS(SÚBOJE!$H:$H,SÚBOJE!$A:$A,C$2,SÚBOJE!$B:$B,$A16)+SUMIFS(SÚBOJE!$I:$I,SÚBOJE!$A:$A,C$2,SÚBOJE!$C:$C,$A16)","v":0},{"$f":"SUMIFS(SÚBOJE!$H:$H,SÚBOJE!$A:$A,D$2,SÚBOJE!$B:$B,$A16)+SUMIFS(SÚBOJE!$I:$I,SÚBOJE!$A:$A,D$2,SÚBOJE!$C:$C,$A16)","v":1.5},{"$f":"SUMIFS(SÚBOJE!$H:$H,SÚBOJE!$A:$A,E$2,SÚBOJE!$B:$B,$A16)+SUMIFS(SÚBOJE!$I:$I,SÚBOJE!$A:$A,E$2,SÚBOJE!$C:$C,$A16)","v":3},{"$f":"SUMIFS(SÚBOJE!$H:$H,SÚBOJE!$A:$A,F$2,SÚBOJE!$B:$B,$A16)+SUMIFS(SÚBOJE!$I:$I,SÚBOJE!$A:$A,F$2,SÚBOJE!$C:$C,$A16)","v":3},{"$f":"SUMIFS(SÚBOJE!$H:$H,SÚBOJE!$A:$A,G$2,SÚBOJE!$B:$B,$A16)+SUMIFS(SÚBOJE!$I:$I,SÚBOJE!$A:$A,G$2,SÚBOJE!$C:$C,$A16)","v":1.5},{"$f":"SUMIFS(SÚBOJE!$H:$H,SÚBOJE!$A:$A,H$2,SÚBOJE!$B:$B,$A16)+SUMIFS(SÚBOJE!$I:$I,SÚBOJE!$A:$A,H$2,SÚBOJE!$C:$C,$A16)","v":3},{"$f":"SUMIFS(SÚBOJE!$H:$H,SÚBOJE!$A:$A,I$2,SÚBOJE!$B:$B,$A16)+SUMIFS(SÚBOJE!$I:$I,SÚBOJE!$A:$A,I$2,SÚBOJE!$C:$C,$A16)","v":3},{"$f":"SUMIFS(SÚBOJE!$H:$H,SÚBOJE!$A:$A,J$2,SÚBOJE!$B:$B,$A16)+SUMIFS(SÚBOJE!$I:$I,SÚBOJE!$A:$A,J$2,SÚBOJE!$C:$C,$A16)","v":1.5},16.5,{"$f":"COUNTIFS(SÚBOJE!$B:$B,$A16,SÚBOJE!$H:$H,3)+COUNTIFS(SÚBOJE!$C:$C,$A16,SÚBOJE!$I:$I,3)","v":4},{"$f":"COUNTIFS(SÚBOJE!$B:$B,$A16,SÚBOJE!$H:$H,1.5)+COUNTIFS(SÚBOJE!$C:$C,$A16,SÚBOJE!$I:$I,1.5)","v":3},{"$f":"SUMIF(TABULKA!$A$3:$A$52,$A16,TABULKA!$K$3:$K$52)","v":29}]
[39,{"$f":"IF(A17<=ZREBOVANIE!$M$1,VLOOKUP(A17,RYBARI!A:C,3,0),\"x\")","v":"Petríček Stanislav"},{"$f":"SUMIFS(SÚBOJE!$H:$H,SÚBOJE!$A:$A,C$2,SÚBOJE!$B:$B,$A17)+SUMIFS(SÚBOJE!$I:$I,SÚBOJE!$A:$A,C$2,SÚBOJE!$C:$C,$A17)","v":3},{"$f":"SUMIFS(SÚBOJE!$H:$H,SÚBOJE!$A:$A,D$2,SÚBOJE!$B:$B,$A17)+SUMIFS(SÚBOJE!$I:$I,SÚBOJE!$A:$A,D$2,SÚBOJE!$C:$C,$A17)","v":0},{"$f":"SUMIFS(SÚBOJE!$H:$H,SÚBOJE!$A:$A,E$2,SÚBOJE!$B:$B,$A17)+SUMIFS(SÚBOJE!$I:$I,SÚBOJE!$A:$A,E$2,SÚBOJE!$C:$C,$A17)","v":3},{"$f":"SUMIFS(SÚBOJE!$H:$H,SÚBOJE!$A:$A,F$2,SÚBOJE!$B:$B,$A17)+SUMIFS(SÚBOJE!$I:$I,SÚBOJE!$A:$A,F$2,SÚBOJE!$C:$C,$A17)","v":0},{"$f":"SUMIFS(SÚBOJE!$H:$H,SÚBOJE!$A:$A,G$2,SÚBOJE!$B:$B,$A17)+SUMIFS(SÚBOJE!$I:$I,SÚBOJE!$A:$A,G$2,SÚBOJE!$C:$C,$A17)","v":3},{"$f":"SUMIFS(SÚBOJE!$H:$H,SÚBOJE!$A:$A,H$2,SÚBOJE!$B:$B,$A17)+SUMIFS(SÚBOJE!$I:$I,SÚBOJE!$A:$A,H$2,SÚBOJE!$C:$C,$A17)","v":3},{"$f":"SUMIFS(SÚBOJE!$H:$H,SÚBOJE!$A:$A,I$2,SÚBOJE!$B:$B,$A17)+SUMIFS(SÚBOJE!$I:$I,SÚBOJE!$A:$A,I$2,SÚBOJE!$C:$C,$A17)","v":0},{"$f":"SUMIFS(SÚBOJE!$H:$H,SÚBOJE!$A:$A,J$2,SÚBOJE!$B:$B,$A17)+SUMIFS(SÚBOJE!$I:$I,SÚBOJE!$A:$A,J$2,SÚBOJE!$C:$C,$A17)","v":3},15,{"$f":"COUNTIFS(SÚBOJE!$B:$B,$A17,SÚBOJE!$H:$H,3)+COUNTIFS(SÚBOJE!$C:$C,$A17,SÚBOJE!$I:$I,3)","v":5},{"$f":"COUNTIFS(SÚBOJE!$B:$B,$A17,SÚBOJE!$H:$H,1.5)+COUNTIFS(SÚBOJE!$C:$C,$A17,SÚBOJE!$I:$I,1.5)","v":0},{"$f":"SUMIF(TABULKA!$A$3:$A$52,$A17,TABULKA!$K$3:$K$52)","v":19}]
[28,{"$f":"IF(A18<=ZREBOVANIE!$M$1,VLOOKUP(A18,RYBARI!A:C,3,0),\"x\")","v":"Šenigla Vladimír"},{"$f":"SUMIFS(SÚBOJE!$H:$H,SÚBOJE!$A:$A,C$2,SÚBOJE!$B:$B,$A18)+SUMIFS(SÚBOJE!$I:$I,SÚBOJE!$A:$A,C$2,SÚBOJE!$C:$C,$A18)","v":3},{"$f":"SUMIFS(SÚBOJE!$H:$H,SÚBOJE!$A:$A,D$2,SÚBOJE!$B:$B,$A18)+SUMIFS(SÚBOJE!$I:$I,SÚBOJE!$A:$A,D$2,SÚBOJE!$C:$C,$A18)","v":3},{"$f":"SUMIFS(SÚBOJE!$H:$H,SÚBOJE!$A:$A,E$2,SÚBOJE!$B:$B,$A18)+SUMIFS(SÚBOJE!$I:$I,SÚBOJE!$A:$A,E$2,SÚBOJE!$C:$C,$A18)","v":3},{"$f":"SUMIFS(SÚBOJE!$H:$H,SÚBOJE!$A:$A,F$2,SÚBOJE!$B:$B,$A18)+SUMIFS(SÚBOJE!$I:$I,SÚBOJE!$A:$A,F$2,SÚBOJE!$C:$C,$A18)","v":3},{"$f":"SUMIFS(SÚBOJE!$H:$H,SÚBOJE!$A:$A,G$2,SÚBOJE!$B:$B,$A18)+SUMIFS(SÚBOJE!$I:$I,SÚBOJE!$A:$A,G$2,SÚBOJE!$C:$C,$A18)","v":0},{"$f":"SUMIFS(SÚBOJE!$H:$H,SÚBOJE!$A:$A,H$2,SÚBOJE!$B:$B,$A18)+SUMIFS(SÚBOJE!$I:$I,SÚBOJE!$A:$A,H$2,SÚBOJE!$C:$C,$A18)","v":3},{"$f":"SUMIFS(SÚBOJE!$H:$H,SÚBOJE!$A:$A,I$2,SÚBOJE!$B:$B,$A18)+SUMIFS(SÚBOJE!$I:$I,SÚBOJE!$A:$A,I$2,SÚBOJE!$C:$C,$A18)","v":0},{"$f":"SUMIFS(SÚBOJE!$H:$H,SÚBOJE!$A:$A,J$2,SÚBOJE!$B:$B,$A18)+SUMIFS(SÚBOJE!$I:$I,SÚBOJE!$A:$A,J$2,SÚBOJE!$C:$C,$A18)","v":0},15,{"$f":"COUNTIFS(SÚBOJE!$B:$B,$A18,SÚBOJE!$H:$H,3)+COUNTIFS(SÚBOJE!$C:$C,$A18,SÚBOJE!$I:$I,3)","v":5},{"$f":"COUNTIFS(SÚBOJE!$B:$B,$A18,SÚBOJE!$H:$H,1.5)+COUNTIFS(SÚBOJE!$C:$C,$A18,SÚBOJE!$I:$I,1.5)","v":0},{"$f":"SUMIF(TABULKA!$A$3:$A$52,$A18,TABULKA!$K$3:$K$52)","v":11}]
[4,{"$f":"IF(A19<=ZREBOVANIE!$M$1,VLOOKUP(A19,RYBARI!A:C,3,0),\"x\")","v":"Drančák David"},{"$f":"SUMIFS(SÚBOJE!$H:$H,SÚBOJE!$A:$A,C$2,SÚBOJE!$B:$B,$A19)+SUMIFS(SÚBOJE!$I:$I,SÚBOJE!$A:$A,C$2,SÚBOJE!$C:$C,$A19)","v":1.5},{"$f":"SUMIFS(SÚBOJE!$H:$H,SÚBOJE!$A:$A,D$2,SÚBOJE!$B:$B,$A19)+SUMIFS(SÚBOJE!$I:$I,SÚBOJE!$A:$A,D$2,SÚBOJE!$C:$C,$A19)","v":3},{"$f":"SUMIFS(SÚBOJE!$H:$H,SÚBOJE!$A:$A,E$2,SÚBOJE!$B:$B,$A19)+SUMIFS(SÚBOJE!$I:$I,SÚBOJE!$A:$A,E$2,SÚBOJE!$C:$C,$A19)","v":3},{"$f":"SUMIFS(SÚBOJE!$H:$H,SÚBOJE!$A:$A,F$2,SÚBOJE!$B:$B,$A19)+SUMIFS(SÚBOJE!$I:$I,SÚBOJE!$A:$A,F$2,SÚBOJE!$C:$C,$A19)","v":0},{"$f":"SUMIFS(SÚBOJE!$H:$H,SÚBOJE!$A:$A,G$2,SÚBOJE!$B:$B,$A19)+SUMIFS(SÚBOJE!$I:$I,SÚBOJE!$A:$A,G$2,SÚBOJE!$C:$C,$A19)","v":1.5},{"$f":"SUMIFS(SÚBOJE!$H:$H,SÚBOJE!$A:$A,H$2,SÚBOJE!$B:$B,$A19)+SUMIFS(SÚBOJE!$I:$I,SÚBOJE!$A:$A,H$2,SÚBOJE!$C:$C,$A19)","v":0},{"$f":"SUMIFS(SÚBOJE!$H:$H,SÚBOJE!$A:$A,I$2,SÚBOJE!$B:$B,$A19)+SUMIFS(SÚBOJE!$I:$I,SÚBOJE!$A:$A,I$2,SÚBOJE!$C:$C,$A19)","v":3},{"$f":"SUMIFS(SÚBOJE!$H:$H,SÚBOJE!$A:$A,J$2,SÚBOJE!$B:$B,$A19)+SUMIFS(SÚBOJE!$I:$I,SÚBOJE!$A:$A,J$2,SÚBOJE!$C:$C,$A19)","v":3},15,{"$f":"COUNTIFS(SÚBOJE!$B:$B,$A19,SÚBOJE!$H:$H,3)+COUNTIFS(SÚBOJE!$C:$C,$A19,SÚBOJE!$I:$I,3)","v":4},{"$f":"COUNTIFS(SÚBOJE!$B:$B,$A19,SÚBOJE!$H:$H,1.5)+COUNTIFS(SÚBOJE!$C:$C,$A19,SÚBOJE!$I:$I,1.5)","v":2},{"$f":"SUMIF(TABULKA!$A$3:$A$52,$A19,TABULKA!$K$3:$K$52)","v":20}]
[14,{"$f":"IF(A20<=ZREBOVANIE!$M$1,VLOOKUP(A20,RYBARI!A:C,3,0),\"x\")","v":"Buršák Roman"},{"$f":"SUMIFS(SÚBOJE!$H:$H,SÚBOJE!$A:$A,C$2,SÚBOJE!$B:$B,$A20)+SUMIFS(SÚBOJE!$I:$I,SÚBOJE!$A:$A,C$2,SÚBOJE!$C:$C,$A20)","v":3},{"$f":"SUMIFS(SÚBOJE!$H:$H,SÚBOJE!$A:$A,D$2,SÚBOJE!$B:$B,$A20)+SUMIFS(SÚBOJE!$I:$I,SÚBOJE!$A:$A,D$2,SÚBOJE!$C:$C,$A20)","v":3},{"$f":"SUMIFS(SÚBOJE!$H:$H,SÚBOJE!$A:$A,E$2,SÚBOJE!$B:$B,$A20)+SUMIFS(SÚBOJE!$I:$I,SÚBOJE!$A:$A,E$2,SÚBOJE!$C:$C,$A20)","v":3},{"$f":"SUMIFS(SÚBOJE!$H:$H,SÚBOJE!$A:$A,F$2,SÚBOJE!$B:$B,$A20)+SUMIFS(SÚBOJE!$I:$I,SÚBOJE!$A:$A,F$2,SÚBOJE!$C:$C,$A20)","v":0},{"$f":"SUMIFS(SÚBOJE!$H:$H,SÚBOJE!$A:$A,G$2,SÚBOJE!$B:$B,$A20)+SUMIFS(SÚBOJE!$I:$I,SÚBOJE!$A:$A,G$2,SÚBOJE!$C:$C,$A20)","v":0},{"$f":"SUMIFS(SÚBOJE!$H:$H,SÚBOJE!$A:$A,H$2,SÚBOJE!$B:$B,$A20)+SUMIFS(SÚBOJE!$I:$I,SÚBOJE!$A:$A,H$2,SÚBOJE!$C:$C,$A20)","v":3},{"$f":"SUMIFS(SÚBOJE!$H:$H,SÚBOJE!$A:$A,I$2,SÚBOJE!$B:$B,$A20)+SUMIFS(SÚBOJE!$I:$I,SÚBOJE!$A:$A,I$2,SÚBOJE!$C:$C,$A20)","v":1.5},{"$f":"SUMIFS(SÚBOJE!$H:$H,SÚBOJE!$A:$A,J$2,SÚBOJE!$B:$B,$A20)+SUMIFS(SÚBOJE!$I:$I,SÚBOJE!$A:$A,J$2,SÚBOJE!$C:$C,$A20)","v":1.5},15,{"$f":"COUNTIFS(SÚBOJE!$B:$B,$A20,SÚBOJE!$H:$H,3)+COUNTIFS(SÚBOJE!$C:$C,$A20,SÚBOJE!$I:$I,3)","v":4},{"$f":"COUNTIFS(SÚBOJE!$B:$B,$A20,SÚBOJE!$H:$H,1.5)+COUNTIFS(SÚBOJE!$C:$C,$A20,SÚBOJE!$I:$I,1.5)","v":2},{"$f":"SUMIF(TABULKA!$A$3:$A$52,$A20,TABULKA!$K$3:$K$52)","v":18}]
[26,{"$f":"IF(A21<=ZREBOVANIE!$M$1,VLOOKUP(A21,RYBARI!A:C,3,0),\"x\")","v":"Krnčan Juraj"},{"$f":"SUMIFS(SÚBOJE!$H:$H,SÚBOJE!$A:$A,C$2,SÚBOJE!$B:$B,$A21)+SUMIFS(SÚBOJE!$I:$I,SÚBOJE!$A:$A,C$2,SÚBOJE!$C:$C,$A21)","v":3},{"$f":"SUMIFS(SÚBOJE!$H:$H,SÚBOJE!$A:$A,D$2,SÚBOJE!$B:$B,$A21)+SUMIFS(SÚBOJE!$I:$I,SÚBOJE!$A:$A,D$2,SÚBOJE!$C:$C,$A21)","v":1.5},{"$f":"SUMIFS(SÚBOJE!$H:$H,SÚBOJE!$A:$A,E$2,SÚBOJE!$B:$B,$A21)+SUMIFS(SÚBOJE!$I:$I,SÚBOJE!$A:$A,E$2,SÚBOJE!$C:$C,$A21)","v":3},{"$f":"SUMIFS(SÚBOJE!$H:$H,SÚBOJE!$A:$A,F$2,SÚBOJE!$B:$B,$A21)+SUMIFS(SÚBOJE!$I:$I,SÚBOJE!$A:$A,F$2,SÚBOJE!$C:$C,$A21)","v":3},{"$f":"SUMIFS(SÚBOJE!$H:$H,SÚBOJE!$A:$A,G$2,SÚBOJE!$B:$B,$A21)+SUMIFS(SÚBOJE!$I:$I,SÚBOJE!$A:$A,G$2,SÚBOJE!$C:$C,$A21)","v":0},{"$f":"SUMIFS(SÚBOJE!$H:$H,SÚBOJE!$A:$A,H$2,SÚBOJE!$B:$B,$A21)+SUMIFS(SÚBOJE!$I:$I,SÚBOJE!$A:$A,H$2,SÚBOJE!$C:$C,$A21)","v":1.5},{"$f":"SUMIFS(SÚBOJE!$H:$H,SÚBOJE!$A:$A,I$2,SÚBOJE!$B:$B,$A21)+SUMIFS(SÚBOJE!$I:$I,SÚBOJE!$A:$A,I$2,SÚBOJE!$C:$C,$A21)","v":0},{"$f":"SUMIFS(SÚBOJE!$H:$H,SÚBOJE!$A:$A,J$2,SÚBOJE!$B:$B,$A21)+SUMIFS(SÚBOJE!$I:$I,SÚBOJE!$A:$A,J$2,SÚBOJE!$C:$C,$A21)","v":3},15,{"$f":"COUNTIFS(SÚBOJE!$B:$B,$A21,SÚBOJE!$H:$H,3)+COUNTIFS(SÚBOJE!$C:$C,$A21,SÚBOJE!$I:$I,3)","v":4},{"$f":"COUNTIFS(SÚBOJE!$B:$B,$A21,SÚBOJE!$H:$H,1.5)+COUNTIFS(SÚBOJE!$C:$C,$A21,SÚBOJE!$I:$I,1.5)","v":2},{"$f":"SUMIF(TABULKA!$A$3:$A$52,$A21,TABULKA!$K$3:$K$52)","v":18}]
[1,{"$f":"IF(A22<=ZREBOVANIE!$M$1,VLOOKUP(A22,RYBARI!A:C,3,0),\"x\")","v":"Šenigla Peter"},{"$f":"SUMIFS(SÚBOJE!$H:$H,SÚBOJE!$A:$A,C$2,SÚBOJE!$B:$B,$A22)+SUMIFS(SÚBOJE!$I:$I,SÚBOJE!$A:$A,C$2,SÚBOJE!$C:$C,$A22)","v":3},{"$f":"SUMIFS(SÚBOJE!$H:$H,SÚBOJE!$A:$A,D$2,SÚBOJE!$B:$B,$A22)+SUMIFS(SÚBOJE!$I:$I,SÚBOJE!$A:$A,D$2,SÚBOJE!$C:$C,$A22)","v":0},{"$f":"SUMIFS(SÚBOJE!$H:$H,SÚBOJE!$A:$A,E$2,SÚBOJE!$B:$B,$A22)+SUMIFS(SÚBOJE!$I:$I,SÚBOJE!$A:$A,E$2,SÚBOJE!$C:$C,$A22)","v":3},{"$f":"SUMIFS(SÚBOJE!$H:$H,SÚBOJE!$A:$A,F$2,SÚBOJE!$B:$B,$A22)+SUMIFS(SÚBOJE!$I:$I,SÚBOJE!$A:$A,F$2,SÚBOJE!$C:$C,$A22)","v":1.5},{"$f":"SUMIFS(SÚBOJE!$H:$H,SÚBOJE!$A:$A,G$2,SÚBOJE!$B:$B,$A22)+SUMIFS(SÚBOJE!$I:$I,SÚBOJE!$A:$A,G$2,SÚBOJE!$C:$C,$A22)","v":3},{"$f":"SUMIFS(SÚBOJE!$H:$H,SÚBOJE!$A:$A,H$2,SÚBOJE!$B:$B,$A22)+SUMIFS(SÚBOJE!$I:$I,SÚBOJE!$A:$A,H$2,SÚBOJE!$C:$C,$A22)","v":0},{"$f":"SUMIFS(SÚBOJE!$H:$H,SÚBOJE!$A:$A,I$2,SÚBOJE!$B:$B,$A22)+SUMIFS(SÚBOJE!$I:$I,SÚBOJE!$A:$A,I$2,SÚBOJE!$C:$C,$A22)","v":3},{"$f":"SUMIFS(SÚBOJE!$H:$H,SÚBOJE!$A:$A,J$2,SÚBOJE!$B:$B,$A22)+SUMIFS(SÚBOJE!$I:$I,SÚBOJE!$A:$A,J$2,SÚBOJE!$C:$C,$A22)","v":0},13.5,{"$f":"COUNTIFS(SÚBOJE!$B:$B,$A22,SÚBOJE!$H:$H,3)+COUNTIFS(SÚBOJE!$C:$C,$A22,SÚBOJE!$I:$I,3)","v":4},{"$f":"COUNTIFS(SÚBOJE!$B:$B,$A22,SÚBOJE!$H:$H,1.5)+COUNTIFS(SÚBOJE!$C:$C,$A22,SÚBOJE!$I:$I,1.5)","v":1},{"$f":"SUMIF(TABULKA!$A$3:$A$52,$A22,TABULKA!$K$3:$K$52)","v":21}]
[3,{"$f":"IF(A23<=ZREBOVANIE!$M$1,VLOOKUP(A23,RYBARI!A:C,3,0),\"x\")","v":"Mešenec Martin"},{"$f":"SUMIFS(SÚBOJE!$H:$H,SÚBOJE!$A:$A,C$2,SÚBOJE!$B:$B,$A23)+SUMIFS(SÚBOJE!$I:$I,SÚBOJE!$A:$A,C$2,SÚBOJE!$C:$C,$A23)","v":1.5},{"$f":"SUMIFS(SÚBOJE!$H:$H,SÚBOJE!$A:$A,D$2,SÚBOJE!$B:$B,$A23)+SUMIFS(SÚBOJE!$I:$I,SÚBOJE!$A:$A,D$2,SÚBOJE!$C:$C,$A23)","v":0},{"$f":"SUMIFS(SÚBOJE!$H:$H,SÚBOJE!$A:$A,E$2,SÚBOJE!$B:$B,$A23)+SUMIFS(SÚBOJE!$I:$I,SÚBOJE!$A:$A,E$2,SÚBOJE!$C:$C,$A23)","v":1.5},{"$f":"SUMIFS(SÚBOJE!$H:$H,SÚBOJE!$A:$A,F$2,SÚBOJE!$B:$B,$A23)+SUMIFS(SÚBOJE!$I:$I,SÚBOJE!$A:$A,F$2,SÚBOJE!$C:$C,$A23)","v":1.5},{"$f":"SUMIFS(SÚBOJE!$H:$H,SÚBOJE!$A:$A,G$2,SÚBOJE!$B:$B,$A23)+SUMIFS(SÚBOJE!$I:$I,SÚBOJE!$A:$A,G$2,SÚBOJE!$C:$C,$A23)","v":3},{"$f":"SUMIFS(SÚBOJE!$H:$H,SÚBOJE!$A:$A,H$2,SÚBOJE!$B:$B,$A23)+SUMIFS(SÚBOJE!$I:$I,SÚBOJE!$A:$A,H$2,SÚBOJE!$C:$C,$A23)","v":3},{"$f":"SUMIFS(SÚBOJE!$H:$H,SÚBOJE!$A:$A,I$2,SÚBOJE!$B:$B,$A23)+SUMIFS(SÚBOJE!$I:$I,SÚBOJE!$A:$A,I$2,SÚBOJE!$C:$C,$A23)","v":3},{"$f":"SUMIFS(SÚBOJE!$H:$H,SÚBOJE!$A:$A,J$2,SÚBOJE!$B:$B,$A23)+SUMIFS(SÚBOJE!$I:$I,SÚBOJE!$A:$A,J$2,SÚBOJE!$C:$C,$A23)","v":0},13.5,{"$f":"COUNTIFS(SÚBOJE!$B:$B,$A23,SÚBOJE!$H:$H,3)+COUNTIFS(SÚBOJE!$C:$C,$A23,SÚBOJE!$I:$I,3)","v":3},{"$f":"COUNTIFS(SÚBOJE!$B:$B,$A23,SÚBOJE!$H:$H,1.5)+COUNTIFS(SÚBOJE!$C:$C,$A23,SÚBOJE!$I:$I,1.5)","v":3},{"$f":"SUMIF(TABULKA!$A$3:$A$52,$A23,TABULKA!$K$3:$K$52)","v":18}]
[12,{"$f":"IF(A24<=ZREBOVANIE!$M$1,VLOOKUP(A24,RYBARI!A:C,3,0),\"x\")","v":"Šintál Adam"},{"$f":"SUMIFS(SÚBOJE!$H:$H,SÚBOJE!$A:$A,C$2,SÚBOJE!$B:$B,$A24)+SUMIFS(SÚBOJE!$I:$I,SÚBOJE!$A:$A,C$2,SÚBOJE!$C:$C,$A24)","v":1.5},{"$f":"SUMIFS(SÚBOJE!$H:$H,SÚBOJE!$A:$A,D$2,SÚBOJE!$B:$B,$A24)+SUMIFS(SÚBOJE!$I:$I,SÚBOJE!$A:$A,D$2,SÚBOJE!$C:$C,$A24)","v":3},{"$f":"SUMIFS(SÚBOJE!$H:$H,SÚBOJE!$A:$A,E$2,SÚBOJE!$B:$B,$A24)+SUMIFS(SÚBOJE!$I:$I,SÚBOJE!$A:$A,E$2,SÚBOJE!$C:$C,$A24)","v":1.5},{"$f":"SUMIFS(SÚBOJE!$H:$H,SÚBOJE!$A:$A,F$2,SÚBOJE!$B:$B,$A24)+SUMIFS(SÚBOJE!$I:$I,SÚBOJE!$A:$A,F$2,SÚBOJE!$C:$C,$A24)","v":3},{"$f":"SUMIFS(SÚBOJE!$H:$H,SÚBOJE!$A:$A,G$2,SÚBOJE!$B:$B,$A24)+SUMIFS(SÚBOJE!$I:$I,SÚBOJE!$A:$A,G$2,SÚBOJE!$C:$C,$A24)","v":3},{"$f":"SUMIFS(SÚBOJE!$H:$H,SÚBOJE!$A:$A,H$2,SÚBOJE!$B:$B,$A24)+SUMIFS(SÚBOJE!$I:$I,SÚBOJE!$A:$A,H$2,SÚBOJE!$C:$C,$A24)","v":1.5},{"$f":"SUMIFS(SÚBOJE!$H:$H,SÚBOJE!$A:$A,I$2,SÚBOJE!$B:$B,$A24)+SUMIFS(SÚBOJE!$I:$I,SÚBOJE!$A:$A,I$2,SÚBOJE!$C:$C,$A24)","v":0},{"$f":"SUMIFS(SÚBOJE!$H:$H,SÚBOJE!$A:$A,J$2,SÚBOJE!$B:$B,$A24)+SUMIFS(SÚBOJE!$I:$I,SÚBOJE!$A:$A,J$2,SÚBOJE!$C:$C,$A24)","v":0},13.5,{"$f":"COUNTIFS(SÚBOJE!$B:$B,$A24,SÚBOJE!$H:$H,3)+COUNTIFS(SÚBOJE!$C:$C,$A24,SÚBOJE!$I:$I,3)","v":3},{"$f":"COUNTIFS(SÚBOJE!$B:$B,$A24,SÚBOJE!$H:$H,1.5)+COUNTIFS(SÚBOJE!$C:$C,$A24,SÚBOJE!$I:$I,1.5)","v":3},{"$f":"SUMIF(TABULKA!$A$3:$A$52,$A24,TABULKA!$K$3:$K$52)","v":17}]
[47,{"$f":"IF(A25<=ZREBOVANIE!$M$1,VLOOKUP(A25,RYBARI!A:C,3,0),\"x\")","v":"Medo Peter"},{"$f":"SUMIFS(SÚBOJE!$H:$H,SÚBOJE!$A:$A,C$2,SÚBOJE!$B:$B,$A25)+SUMIFS(SÚBOJE!$I:$I,SÚBOJE!$A:$A,C$2,SÚBOJE!$C:$C,$A25)","v":3},{"$f":"SUMIFS(SÚBOJE!$H:$H,SÚBOJE!$A:$A,D$2,SÚBOJE!$B:$B,$A25)+SUMIFS(SÚBOJE!$I:$I,SÚBOJE!$A:$A,D$2,SÚBOJE!$C:$C,$A25)","v":0},{"$f":"SUMIFS(SÚBOJE!$H:$H,SÚBOJE!$A:$A,E$2,SÚBOJE!$B:$B,$A25)+SUMIFS(SÚBOJE!$I:$I,SÚBOJE!$A:$A,E$2,SÚBOJE!$C:$C,$A25)","v":3},{"$f":"SUMIFS(SÚBOJE!$H:$H,SÚBOJE!$A:$A,F$2,SÚBOJE!$B:$B,$A25)+SUMIFS(SÚBOJE!$I:$I,SÚBOJE!$A:$A,F$2,SÚBOJE!$C:$C,$A25)","v":1.5},{"$f":"SUMIFS(SÚBOJE!$H:$H,SÚBOJE!$A:$A,G$2,SÚBOJE!$B:$B,$A25)+SUMIFS(SÚBOJE!$I:$I,SÚBOJE!$A:$A,G$2,SÚBOJE!$C:$C,$A25)","v":3},{"$f":"SUMIFS(SÚBOJE!$H:$H,SÚBOJE!$A:$A,H$2,SÚBOJE!$B:$B,$A25)+SUMIFS(SÚBOJE!$I:$I,SÚBOJE!$A:$A,H$2,SÚBOJE!$C:$C,$A25)","v":1.5},{"$f":"SUMIFS(SÚBOJE!$H:$H,SÚBOJE!$A:$A,I$2,SÚBOJE!$B:$B,$A25)+SUMIFS(SÚBOJE!$I:$I,SÚBOJE!$A:$A,I$2,SÚBOJE!$C:$C,$A25)","v":1.5},{"$f":"SUMIFS(SÚBOJE!$H:$H,SÚBOJE!$A:$A,J$2,SÚBOJE!$B:$B,$A25)+SUMIFS(SÚBOJE!$I:$I,SÚBOJE!$A:$A,J$2,SÚBOJE!$C:$C,$A25)","v":0},13.5,{"$f":"COUNTIFS(SÚBOJE!$B:$B,$A25,SÚBOJE!$H:$H,3)+COUNTIFS(SÚBOJE!$C:$C,$A25,SÚBOJE!$I:$I,3)","v":3},{"$f":"COUNTIFS(SÚBOJE!$B:$B,$A25,SÚBOJE!$H:$H,1.5)+COUNTIFS(SÚBOJE!$C:$C,$A25,SÚBOJE!$I:$I,1.5)","v":3},{"$f":"SUMIF(TABULKA!$A$3:$A$52,$A25,TABULKA!$K$3:$K$52)","v":14}]
[2,{"$f":"IF(A26<=ZREBOVANIE!$M$1,VLOOKUP(A26,RYBARI!A:C,3,0),\"x\")","v":"Masarech Michal"},{"$f":"SUMIFS(SÚBOJE!$H:$H,SÚBOJE!$A:$A,C$2,SÚBOJE!$B:$B,$A26)+SUMIFS(SÚBOJE!$I:$I,SÚBOJE!$A:$A,C$2,SÚBOJE!$C:$C,$A26)","v":0},{"$f":"SUMIFS(SÚBOJE!$H:$H,SÚBOJE!$A:$A,D$2,SÚBOJE!$B:$B,$A26)+SUMIFS(SÚBOJE!$I:$I,SÚBOJE!$A:$A,D$2,SÚBOJE!$C:$C,$A26)","v":1},{"$f":"SUMIFS(SÚBOJE!$H:$H,SÚBOJE!$A:$A,E$2,SÚBOJE!$B:$B,$A26)+SUMIFS(SÚBOJE!$I:$I,SÚBOJE!$A:$A,E$2,SÚBOJE!$C:$C,$A26)","v":0},{"$f":"SUMIFS(SÚBOJE!$H:$H,SÚBOJE!$A:$A,F$2,SÚBOJE!$B:$B,$A26)+SUMIFS(SÚBOJE!$I:$I,SÚBOJE!$A:$A,F$2,SÚBOJE!$C:$C,$A26)","v":3},{"$f":"SUMIFS(SÚBOJE!$H:$H,SÚBOJE!$A:$A,G$2,SÚBOJE!$B:$B,$A26)+SUMIFS(SÚBOJE!$I:$I,SÚBOJE!$A:$A,G$2,SÚBOJE!$C:$C,$A26)","v":1.5},{"$f":"SUMIFS(SÚBOJE!$H:$H,SÚBOJE!$A:$A,H$2,SÚBOJE!$B:$B,$A26)+SUMIFS(SÚBOJE!$I:$I,SÚBOJE!$A:$A,H$2,SÚBOJE!$C:$C,$A26)","v":3},{"$f":"SUMIFS(SÚBOJE!$H:$H,SÚBOJE!$A:$A,I$2,SÚBOJE!$B:$B,$A26)+SUMIFS(SÚBOJE!$I:$I,SÚBOJE!$A:$A,I$2,SÚBOJE!$C:$C,$A26)","v":3},{"$f":"SUMIFS(SÚBOJE!$H:$H,SÚBOJE!$A:$A,J$2,SÚBOJE!$B:$B,$A26)+SUMIFS(SÚBOJE!$I:$I,SÚBOJE!$A:$A,J$2,SÚBOJE!$C:$C,$A26)","v":1},12.5,{"$f":"COUNTIFS(SÚBOJE!$B:$B,$A26,SÚBOJE!$H:$H,3)+COUNTIFS(SÚBOJE!$C:$C,$A26,SÚBOJE!$I:$I,3)","v":3},{"$f":"COUNTIFS(SÚBOJE!$B:$B,$A26,SÚBOJE!$H:$H,1.5)+COUNTIFS(SÚBOJE!$C:$C,$A26,SÚBOJE!$I:$I,1.5)","v":1},{"$f":"SUMIF(TABULKA!$A$3:$A$52,$A26,TABULKA!$K$3:$K$52)","v":7}]
[41,{"$f":"IF(A27<=ZREBOVANIE!$M$1,VLOOKUP(A27,RYBARI!A:C,3,0),\"x\")","v":"Schwarcz Roman"},{"$f":"SUMIFS(SÚBOJE!$H:$H,SÚBOJE!$A:$A,C$2,SÚBOJE!$B:$B,$A27)+SUMIFS(SÚBOJE!$I:$I,SÚBOJE!$A:$A,C$2,SÚBOJE!$C:$C,$A27)","v":0},{"$f":"SUMIFS(SÚBOJE!$H:$H,SÚBOJE!$A:$A,D$2,SÚBOJE!$B:$B,$A27)+SUMIFS(SÚBOJE!$I:$I,SÚBOJE!$A:$A,D$2,SÚBOJE!$C:$C,$A27)","v":0},{"$f":"SUMIFS(SÚBOJE!$H:$H,SÚBOJE!$A:$A,E$2,SÚBOJE!$B:$B,$A27)+SUMIFS(SÚBOJE!$I:$I,SÚBOJE!$A:$A,E$2,SÚBOJE!$C:$C,$A27)","v":3},{"$f":"SUMIFS(SÚBOJE!$H:$H,SÚBOJE!$A:$A,F$2,SÚBOJE!$B:$B,$A27)+SUMIFS(SÚBOJE!$I:$I,SÚBOJE!$A:$A,F$2,SÚBOJE!$C:$C,$A27)","v":0},{"$f":"SUMIFS(SÚBOJE!$H:$H,SÚBOJE!$A:$A,G$2,SÚBOJE!$B:$B,$A27)+SUMIFS(SÚBOJE!$I:$I,SÚBOJE!$A:$A,G$2,SÚBOJE!$C:$C,$A27)","v":1.5},{"$f":"SUMIFS(SÚBOJE!$H:$H,SÚBOJE!$A:$A,H$2,SÚBOJE!$B:$B,$A27)+SUMIFS(SÚBOJE!$I:$I,SÚBOJE!$A:$A,H$2,SÚBOJE!$C:$C,$A27)","v":3},{"$f":"SUMIFS(SÚBOJE!$H:$H,SÚBOJE!$A:$A,I$2,SÚBOJE!$B:$B,$A27)+SUMIFS(SÚBOJE!$I:$I,SÚBOJE!$A:$A,I$2,SÚBOJE!$C:$C,$A27)","v":3},{"$f":"SUMIFS(SÚBOJE!$H:$H,SÚBOJE!$A:$A,J$2,SÚBOJE!$B:$B,$A27)+SUMIFS(SÚBOJE!$I:$I,SÚBOJE!$A:$A,J$2,SÚBOJE!$C:$C,$A27)","v":1.5},12,{"$f":"COUNTIFS(SÚBOJE!$B:$B,$A27,SÚBOJE!$H:$H,3)+COUNTIFS(SÚBOJE!$C:$C,$A27,SÚBOJE!$I:$I,3)","v":3},{"$f":"COUNTIFS(SÚBOJE!$B:$B,$A27,SÚBOJE!$H:$H,1.5)+COUNTIFS(SÚBOJE!$C:$C,$A27,SÚBOJE!$I:$I,1.5)","v":2},{"$f":"SUMIF(TABULKA!$A$3:$A$52,$A27,TABULKA!$K$3:$K$52)","v":17}]
[45,{"$f":"IF(A28<=ZREBOVANIE!$M$1,VLOOKUP(A28,RYBARI!A:C,3,0),\"x\")","v":"Popovič Milan"},{"$f":"SUMIFS(SÚBOJE!$H:$H,SÚBOJE!$A:$A,C$2,SÚBOJE!$B:$B,$A28)+SUMIFS(SÚBOJE!$I:$I,SÚBOJE!$A:$A,C$2,SÚBOJE!$C:$C,$A28)","v":3},{"$f":"SUMIFS(SÚBOJE!$H:$H,SÚBOJE!$A:$A,D$2,SÚBOJE!$B:$B,$A28)+SUMIFS(SÚBOJE!$I:$I,SÚBOJE!$A:$A,D$2,SÚBOJE!$C:$C,$A28)","v":1.5},{"$f":"SUMIFS(SÚBOJE!$H:$H,SÚBOJE!$A:$A,E$2,SÚBOJE!$B:$B,$A28)+SUMIFS(SÚBOJE!$I:$I,SÚBOJE!$A:$A,E$2,SÚBOJE!$C:$C,$A28)","v":0},{"$f":"SUMIFS(SÚBOJE!$H:$H,SÚBOJE!$A:$A,F$2,SÚBOJE!$B:$B,$A28)+SUMIFS(SÚBOJE!$I:$I,SÚBOJE!$A:$A,F$2,SÚBOJE!$C:$C,$A28)","v":3},{"$f":"SUMIFS(SÚBOJE!$H:$H,SÚBOJE!$A:$A,G$2,SÚBOJE!$B:$B,$A28)+SUMIFS(SÚBOJE!$I:$I,SÚBOJE!$A:$A,G$2,SÚBOJE!$C:$C,$A28)","v":3},{"$f":"SUMIFS(SÚBOJE!$H:$H,SÚBOJE!$A:$A,H$2,SÚBOJE!$B:$B,$A28)+SUMIFS(SÚBOJE!$I:$I,SÚBOJE!$A:$A,H$2,SÚBOJE!$C:$C,$A28)","v":0},{"$f":"SUMIFS(SÚBOJE!$H:$H,SÚBOJE!$A:$A,I$2,SÚBOJE!$B:$B,$A28)+SUMIFS(SÚBOJE!$I:$I,SÚBOJE!$A:$A,I$2,SÚBOJE!$C:$C,$A28)","v":0},{"$f":"SUMIFS(SÚBOJE!$H:$H,SÚBOJE!$A:$A,J$2,SÚBOJE!$B:$B,$A28)+SUMIFS(SÚBOJE!$I:$I,SÚBOJE!$A:$A,J$2,SÚBOJE!$C:$C,$A28)","v":1},11.5,{"$f":"COUNTIFS(SÚBOJE!$B:$B,$A28,SÚBOJE!$H:$H,3)+COUNTIFS(SÚBOJE!$C:$C,$A28,SÚBOJE!$I:$I,3)","v":3},{"$f":"COUNTIFS(SÚBOJE!$B:$B,$A28,SÚBOJE!$H:$H,1.5)+COUNTIFS(SÚBOJE!$C:$C,$A28,SÚBOJE!$I:$I,1.5)","v":1},{"$f":"SUMIF(TABULKA!$A$3:$A$52,$A28,TABULKA!$K$3:$K$52)","v":21}]
[29,{"$f":"IF(A29<=ZREBOVANIE!$M$1,VLOOKUP(A29,RYBARI!A:C,3,0),\"x\")","v":"Révay Dušan"},{"$f":"SUMIFS(SÚBOJE!$H:$H,SÚBOJE!$A:$A,C$2,SÚBOJE!$B:$B,$A29)+SUMIFS(SÚBOJE!$I:$I,SÚBOJE!$A:$A,C$2,SÚBOJE!$C:$C,$A29)","v":0},{"$f":"SUMIFS(SÚBOJE!$H:$H,SÚBOJE!$A:$A,D$2,SÚBOJE!$B:$B,$A29)+SUMIFS(SÚBOJE!$I:$I,SÚBOJE!$A:$A,D$2,SÚBOJE!$C:$C,$A29)","v":3},{"$f":"SUMIFS(SÚBOJE!$H:$H,SÚBOJE!$A:$A,E$2,SÚBOJE!$B:$B,$A29)+SUMIFS(SÚBOJE!$I:$I,SÚBOJE!$A:$A,E$2,SÚBOJE!$C:$C,$A29)","v":0},{"$f":"SUMIFS(SÚBOJE!$H:$H,SÚBOJE!$A:$A,F$2,SÚBOJE!$B:$B,$A29)+SUMIFS(SÚBOJE!$I:$I,SÚBOJE!$A:$A,F$2,SÚBOJE!$C:$C,$A29)","v":0},{"$f":"SUMIFS(SÚBOJE!$H:$H,SÚBOJE!$A:$A,G$2,SÚBOJE!$B:$B,$A29)+SUMIFS(SÚBOJE!$I:$I,SÚBOJE!$A:$A,G$2,SÚBOJE!$C:$C,$A29)","v":3},{"$f":"SUMIFS(SÚBOJE!$H:$H,SÚBOJE!$A:$A,H$2,SÚBOJE!$B:$B,$A29)+SUMIFS(SÚBOJE!$I:$I,SÚBOJE!$A:$A,H$2,SÚBOJE!$C:$C,$A29)","v":1.5},{"$f":"SUMIFS(SÚBOJE!$H:$H,SÚBOJE!$A:$A,I$2,SÚBOJE!$B:$B,$A29)+SUMIFS(SÚBOJE!$I:$I,SÚBOJE!$A:$A,I$2,SÚBOJE!$C:$C,$A29)","v":3},{"$f":"SUMIFS(SÚBOJE!$H:$H,SÚBOJE!$A:$A,J$2,SÚBOJE!$B:$B,$A29)+SUMIFS(SÚBOJE!$I:$I,SÚBOJE!$A:$A,J$2,SÚBOJE!$C:$C,$A29)","v":0},10.5,{"$f":"COUNTIFS(SÚBOJE!$B:$B,$A29,SÚBOJE!$H:$H,3)+COUNTIFS(SÚBOJE!$C:$C,$A29,SÚBOJE!$I:$I,3)","v":3},{"$f":"COUNTIFS(SÚBOJE!$B:$B,$A29,SÚBOJE!$H:$H,1.5)+COUNTIFS(SÚBOJE!$C:$C,$A29,SÚBOJE!$I:$I,1.5)","v":1},{"$f":"SUMIF(TABULKA!$A$3:$A$52,$A29,TABULKA!$K$3:$K$52)","v":18}]
[9,{"$f":"IF(A30<=ZREBOVANIE!$M$1,VLOOKUP(A30,RYBARI!A:C,3,0),\"x\")","v":"Spáčil Matej"},{"$f":"SUMIFS(SÚBOJE!$H:$H,SÚBOJE!$A:$A,C$2,SÚBOJE!$B:$B,$A30)+SUMIFS(SÚBOJE!$I:$I,SÚBOJE!$A:$A,C$2,SÚBOJE!$C:$C,$A30)","v":0},{"$f":"SUMIFS(SÚBOJE!$H:$H,SÚBOJE!$A:$A,D$2,SÚBOJE!$B:$B,$A30)+SUMIFS(SÚBOJE!$I:$I,SÚBOJE!$A:$A,D$2,SÚBOJE!$C:$C,$A30)","v":3},{"$f":"SUMIFS(SÚBOJE!$H:$H,SÚBOJE!$A:$A,E$2,SÚBOJE!$B:$B,$A30)+SUMIFS(SÚBOJE!$I:$I,SÚBOJE!$A:$A,E$2,SÚBOJE!$C:$C,$A30)","v":0},{"$f":"SUMIFS(SÚBOJE!$H:$H,SÚBOJE!$A:$A,F$2,SÚBOJE!$B:$B,$A30)+SUMIFS(SÚBOJE!$I:$I,SÚBOJE!$A:$A,F$2,SÚBOJE!$C:$C,$A30)","v":0},{"$f":"SUMIFS(SÚBOJE!$H:$H,SÚBOJE!$A:$A,G$2,SÚBOJE!$B:$B,$A30)+SUMIFS(SÚBOJE!$I:$I,SÚBOJE!$A:$A,G$2,SÚBOJE!$C:$C,$A30)","v":3},{"$f":"SUMIFS(SÚBOJE!$H:$H,SÚBOJE!$A:$A,H$2,SÚBOJE!$B:$B,$A30)+SUMIFS(SÚBOJE!$I:$I,SÚBOJE!$A:$A,H$2,SÚBOJE!$C:$C,$A30)","v":0},{"$f":"SUMIFS(SÚBOJE!$H:$H,SÚBOJE!$A:$A,I$2,SÚBOJE!$B:$B,$A30)+SUMIFS(SÚBOJE!$I:$I,SÚBOJE!$A:$A,I$2,SÚBOJE!$C:$C,$A30)","v":3},{"$f":"SUMIFS(SÚBOJE!$H:$H,SÚBOJE!$A:$A,J$2,SÚBOJE!$B:$B,$A30)+SUMIFS(SÚBOJE!$I:$I,SÚBOJE!$A:$A,J$2,SÚBOJE!$C:$C,$A30)","v":1.5},10.5,{"$f":"COUNTIFS(SÚBOJE!$B:$B,$A30,SÚBOJE!$H:$H,3)+COUNTIFS(SÚBOJE!$C:$C,$A30,SÚBOJE!$I:$I,3)","v":3},{"$f":"COUNTIFS(SÚBOJE!$B:$B,$A30,SÚBOJE!$H:$H,1.5)+COUNTIFS(SÚBOJE!$C:$C,$A30,SÚBOJE!$I:$I,1.5)","v":1},{"$f":"SUMIF(TABULKA!$A$3:$A$52,$A30,TABULKA!$K$3:$K$52)","v":16}]
[10,{"$f":"IF(A31<=ZREBOVANIE!$M$1,VLOOKUP(A31,RYBARI!A:C,3,0),\"x\")","v":"Kollár Mikuláš"},{"$f":"SUMIFS(SÚBOJE!$H:$H,SÚBOJE!$A:$A,C$2,SÚBOJE!$B:$B,$A31)+SUMIFS(SÚBOJE!$I:$I,SÚBOJE!$A:$A,C$2,SÚBOJE!$C:$C,$A31)","v":3},{"$f":"SUMIFS(SÚBOJE!$H:$H,SÚBOJE!$A:$A,D$2,SÚBOJE!$B:$B,$A31)+SUMIFS(SÚBOJE!$I:$I,SÚBOJE!$A:$A,D$2,SÚBOJE!$C:$C,$A31)","v":0},{"$f":"SUMIFS(SÚBOJE!$H:$H,SÚBOJE!$A:$A,E$2,SÚBOJE!$B:$B,$A31)+SUMIFS(SÚBOJE!$I:$I,SÚBOJE!$A:$A,E$2,SÚBOJE!$C:$C,$A31)","v":0},{"$f":"SUMIFS(SÚBOJE!$H:$H,SÚBOJE!$A:$A,F$2,SÚBOJE!$B:$B,$A31)+SUMIFS(SÚBOJE!$I:$I,SÚBOJE!$A:$A,F$2,SÚBOJE!$C:$C,$A31)","v":3},{"$f":"SUMIFS(SÚBOJE!$H:$H,SÚBOJE!$A:$A,G$2,SÚBOJE!$B:$B,$A31)+SUMIFS(SÚBOJE!$I:$I,SÚBOJE!$A:$A,G$2,SÚBOJE!$C:$C,$A31)","v":1.5},{"$f":"SUMIFS(SÚBOJE!$H:$H,SÚBOJE!$A:$A,H$2,SÚBOJE!$B:$B,$A31)+SUMIFS(SÚBOJE!$I:$I,SÚBOJE!$A:$A,H$2,SÚBOJE!$C:$C,$A31)","v":0},{"$f":"SUMIFS(SÚBOJE!$H:$H,SÚBOJE!$A:$A,I$2,SÚBOJE!$B:$B,$A31)+SUMIFS(SÚBOJE!$I:$I,SÚBOJE!$A:$A,I$2,SÚBOJE!$C:$C,$A31)","v":3},{"$f":"SUMIFS(SÚBOJE!$H:$H,SÚBOJE!$A:$A,J$2,SÚBOJE!$B:$B,$A31)+SUMIFS(SÚBOJE!$I:$I,SÚBOJE!$A:$A,J$2,SÚBOJE!$C:$C,$A31)","v":0},10.5,{"$f":"COUNTIFS(SÚBOJE!$B:$B,$A31,SÚBOJE!$H:$H,3)+COUNTIFS(SÚBOJE!$C:$C,$A31,SÚBOJE!$I:$I,3)","v":3},{"$f":"COUNTIFS(SÚBOJE!$B:$B,$A31,SÚBOJE!$H:$H,1.5)+COUNTIFS(SÚBOJE!$C:$C,$A31,SÚBOJE!$I:$I,1.5)","v":1},{"$f":"SUMIF(TABULKA!$A$3:$A$52,$A31,TABULKA!$K$3:$K$52)","v":14}]
[40,{"$f":"IF(A32<=ZREBOVANIE!$M$1,VLOOKUP(A32,RYBARI!A:C,3,0),\"x\")","v":"Smorada Ján"},{"$f":"SUMIFS(SÚBOJE!$H:$H,SÚBOJE!$A:$A,C$2,SÚBOJE!$B:$B,$A32)+SUMIFS(SÚBOJE!$I:$I,SÚBOJE!$A:$A,C$2,SÚBOJE!$C:$C,$A32)","v":0},{"$f":"SUMIFS(SÚBOJE!$H:$H,SÚBOJE!$A:$A,D$2,SÚBOJE!$B:$B,$A32)+SUMIFS(SÚBOJE!$I:$I,SÚBOJE!$A:$A,D$2,SÚBOJE!$C:$C,$A32)","v":0},{"$f":"SUMIFS(SÚBOJE!$H:$H,SÚBOJE!$A:$A,E$2,SÚBOJE!$B:$B,$A32)+SUMIFS(SÚBOJE!$I:$I,SÚBOJE!$A:$A,E$2,SÚBOJE!$C:$C,$A32)","v":3},{"$f":"SUMIFS(SÚBOJE!$H:$H,SÚBOJE!$A:$A,F$2,SÚBOJE!$B:$B,$A32)+SUMIFS(SÚBOJE!$I:$I,SÚBOJE!$A:$A,F$2,SÚBOJE!$C:$C,$A32)","v":1.5},{"$f":"SUMIFS(SÚBOJE!$H:$H,SÚBOJE!$A:$A,G$2,SÚBOJE!$B:$B,$A32)+SUMIFS(SÚBOJE!$I:$I,SÚBOJE!$A:$A,G$2,SÚBOJE!$C:$C,$A32)","v":1.5},{"$f":"SUMIFS(SÚBOJE!$H:$H,SÚBOJE!$A:$A,H$2,SÚBOJE!$B:$B,$A32)+SUMIFS(SÚBOJE!$I:$I,SÚBOJE!$A:$A,H$2,SÚBOJE!$C:$C,$A32)","v":3},{"$f":"SUMIFS(SÚBOJE!$H:$H,SÚBOJE!$A:$A,I$2,SÚBOJE!$B:$B,$A32)+SUMIFS(SÚBOJE!$I:$I,SÚBOJE!$A:$A,I$2,SÚBOJE!$C:$C,$A32)","v":0},{"$f":"SUMIFS(SÚBOJE!$H:$H,SÚBOJE!$A:$A,J$2,SÚBOJE!$B:$B,$A32)+SUMIFS(SÚBOJE!$I:$I,SÚBOJE!$A:$A,J$2,SÚBOJE!$C:$C,$A32)","v":1.5},10.5,{"$f":"COUNTIFS(SÚBOJE!$B:$B,$A32,SÚBOJE!$H:$H,3)+COUNTIFS(SÚBOJE!$C:$C,$A32,SÚBOJE!$I:$I,3)","v":2},{"$f":"COUNTIFS(SÚBOJE!$B:$B,$A32,SÚBOJE!$H:$H,1.5)+COUNTIFS(SÚBOJE!$C:$C,$A32,SÚBOJE!$I:$I,1.5)","v":3},{"$f":"SUMIF(TABULKA!$A$3:$A$52,$A32,TABULKA!$K$3:$K$52)","v":16}]
[43,{"$f":"IF(A33<=ZREBOVANIE!$M$1,VLOOKUP(A33,RYBARI!A:C,3,0),\"x\")","v":"Michalka Marián"},{"$f":"SUMIFS(SÚBOJE!$H:$H,SÚBOJE!$A:$A,C$2,SÚBOJE!$B:$B,$A33)+SUMIFS(SÚBOJE!$I:$I,SÚBOJE!$A:$A,C$2,SÚBOJE!$C:$C,$A33)","v":3},{"$f":"SUMIFS(SÚBOJE!$H:$H,SÚBOJE!$A:$A,D$2,SÚBOJE!$B:$B,$A33)+SUMIFS(SÚBOJE!$I:$I,SÚBOJE!$A:$A,D$2,SÚBOJE!$C:$C,$A33)","v":3},{"$f":"SUMIFS(SÚBOJE!$H:$H,SÚBOJE!$A:$A,E$2,SÚBOJE!$B:$B,$A33)+SUMIFS(SÚBOJE!$I:$I,SÚBOJE!$A:$A,E$2,SÚBOJE!$C:$C,$A33)","v":0},{"$f":"SUMIFS(SÚBOJE!$H:$H,SÚBOJE!$A:$A,F$2,SÚBOJE!$B:$B,$A33)+SUMIFS(SÚBOJE!$I:$I,SÚBOJE!$A:$A,F$2,SÚBOJE!$C:$C,$A33)","v":0},{"$f":"SUMIFS(SÚBOJE!$H:$H,SÚBOJE!$A:$A,G$2,SÚBOJE!$B:$B,$A33)+SUMIFS(SÚBOJE!$I:$I,SÚBOJE!$A:$A,G$2,SÚBOJE!$C:$C,$A33)","v":0},{"$f":"SUMIFS(SÚBOJE!$H:$H,SÚBOJE!$A:$A,H$2,SÚBOJE!$B:$B,$A33)+SUMIFS(SÚBOJE!$I:$I,SÚBOJE!$A:$A,H$2,SÚBOJE!$C:$C,$A33)","v":0},{"$f":"SUMIFS(SÚBOJE!$H:$H,SÚBOJE!$A:$A,I$2,SÚBOJE!$B:$B,$A33)+SUMIFS(SÚBOJE!$I:$I,SÚBOJE!$A:$A,I$2,SÚBOJE!$C:$C,$A33)","v":0},{"$f":"SUMIFS(SÚBOJE!$H:$H,SÚBOJE!$A:$A,J$2,SÚBOJE!$B:$B,$A33)+SUMIFS(SÚBOJE!$I:$I,SÚBOJE!$A:$A,J$2,SÚBOJE!$C:$C,$A33)","v":3},9,{"$f":"COUNTIFS(SÚBOJE!$B:$B,$A33,SÚBOJE!$H:$H,3)+COUNTIFS(SÚBOJE!$C:$C,$A33,SÚBOJE!$I:$I,3)","v":3},{"$f":"COUNTIFS(SÚBOJE!$B:$B,$A33,SÚBOJE!$H:$H,1.5)+COUNTIFS(SÚBOJE!$C:$C,$A33,SÚBOJE!$I:$I,1.5)","v":0},{"$f":"SUMIF(TABULKA!$A$3:$A$52,$A33,TABULKA!$K$3:$K$52)","v":22}]
[24,{"$f":"IF(A34<=ZREBOVANIE!$M$1,VLOOKUP(A34,RYBARI!A:C,3,0),\"x\")","v":"Pecník Branislav"},{"$f":"SUMIFS(SÚBOJE!$H:$H,SÚBOJE!$A:$A,C$2,SÚBOJE!$B:$B,$A34)+SUMIFS(SÚBOJE!$I:$I,SÚBOJE!$A:$A,C$2,SÚBOJE!$C:$C,$A34)","v":3},{"$f":"SUMIFS(SÚBOJE!$H:$H,SÚBOJE!$A:$A,D$2,SÚBOJE!$B:$B,$A34)+SUMIFS(SÚBOJE!$I:$I,SÚBOJE!$A:$A,D$2,SÚBOJE!$C:$C,$A34)","v":0},{"$f":"SUMIFS(SÚBOJE!$H:$H,SÚBOJE!$A:$A,E$2,SÚBOJE!$B:$B,$A34)+SUMIFS(SÚBOJE!$I:$I,SÚBOJE!$A:$A,E$2,SÚBOJE!$C:$C,$A34)","v":0},{"$f":"SUMIFS(SÚBOJE!$H:$H,SÚBOJE!$A:$A,F$2,SÚBOJE!$B:$B,$A34)+SUMIFS(SÚBOJE!$I:$I,SÚBOJE!$A:$A,F$2,SÚBOJE!$C:$C,$A34)","v":0},{"$f":"SUMIFS(SÚBOJE!$H:$H,SÚBOJE!$A:$A,G$2,SÚBOJE!$B:$B,$A34)+SUMIFS(SÚBOJE!$I:$I,SÚBOJE!$A:$A,G$2,SÚBOJE!$C:$C,$A34)","v":0},{"$f":"SUMIFS(SÚBOJE!$H:$H,SÚBOJE!$A:$A,H$2,SÚBOJE!$B:$B,$A34)+SUMIFS(SÚBOJE!$I:$I,SÚBOJE!$A:$A,H$2,SÚBOJE!$C:$C,$A34)","v":1.5},{"$f":"SUMIFS(SÚBOJE!$H:$H,SÚBOJE!$A:$A,I$2,SÚBOJE!$B:$B,$A34)+SUMIFS(SÚBOJE!$I:$I,SÚBOJE!$A:$A,I$2,SÚBOJE!$C:$C,$A34)","v":1.5},{"$f":"SUMIFS(SÚBOJE!$H:$H,SÚBOJE!$A:$A,J$2,SÚBOJE!$B:$B,$A34)+SUMIFS(SÚBOJE!$I:$I,SÚBOJE!$A:$A,J$2,SÚBOJE!$C:$C,$A34)","v":3},9,{"$f":"COUNTIFS(SÚBOJE!$B:$B,$A34,SÚBOJE!$H:$H,3)+COUNTIFS(SÚBOJE!$C:$C,$A34,SÚBOJE!$I:$I,3)","v":2},{"$f":"COUNTIFS(SÚBOJE!$B:$B,$A34,SÚBOJE!$H:$H,1.5)+COUNTIFS(SÚBOJE!$C:$C,$A34,SÚBOJE!$I:$I,1.5)","v":2},{"$f":"SUMIF(TABULKA!$A$3:$A$52,$A34,TABULKA!$K$3:$K$52)","v":19}]
[25,{"$f":"IF(A35<=ZREBOVANIE!$M$1,VLOOKUP(A35,RYBARI!A:C,3,0),\"x\")","v":"Drahoš Matúš"},{"$f":"SUMIFS(SÚBOJE!$H:$H,SÚBOJE!$A:$A,C$2,SÚBOJE!$B:$B,$A35)+SUMIFS(SÚBOJE!$I:$I,SÚBOJE!$A:$A,C$2,SÚBOJE!$C:$C,$A35)","v":0},{"$f":"SUMIFS(SÚBOJE!$H:$H,SÚBOJE!$A:$A,D$2,SÚBOJE!$B:$B,$A35)+SUMIFS(SÚBOJE!$I:$I,SÚBOJE!$A:$A,D$2,SÚBOJE!$C:$C,$A35)","v":1.5},{"$f":"SUMIFS(SÚBOJE!$H:$H,SÚBOJE!$A:$A,E$2,SÚBOJE!$B:$B,$A35)+SUMIFS(SÚBOJE!$I:$I,SÚBOJE!$A:$A,E$2,SÚBOJE!$C:$C,$A35)","v":1.5},{"$f":"SUMIFS(SÚBOJE!$H:$H,SÚBOJE!$A:$A,F$2,SÚBOJE!$B:$B,$A35)+SUMIFS(SÚBOJE!$I:$I,SÚBOJE!$A:$A,F$2,SÚBOJE!$C:$C,$A35)","v":3},{"$f":"SUMIFS(SÚBOJE!$H:$H,SÚBOJE!$A:$A,G$2,SÚBOJE!$B:$B,$A35)+SUMIFS(SÚBOJE!$I:$I,SÚBOJE!$A:$A,G$2,SÚBOJE!$C:$C,$A35)","v":0},{"$f":"SUMIFS(SÚBOJE!$H:$H,SÚBOJE!$A:$A,H$2,SÚBOJE!$B:$B,$A35)+SUMIFS(SÚBOJE!$I:$I,SÚBOJE!$A:$A,H$2,SÚBOJE!$C:$C,$A35)","v":3},{"$f":"SUMIFS(SÚBOJE!$H:$H,SÚBOJE!$A:$A,I$2,SÚBOJE!$B:$B,$A35)+SUMIFS(SÚBOJE!$I:$I,SÚBOJE!$A:$A,I$2,SÚBOJE!$C:$C,$A35)","v":0},{"$f":"SUMIFS(SÚBOJE!$H:$H,SÚBOJE!$A:$A,J$2,SÚBOJE!$B:$B,$A35)+SUMIFS(SÚBOJE!$I:$I,SÚBOJE!$A:$A,J$2,SÚBOJE!$C:$C,$A35)","v":0},{"$f":"SUM(C35:J35)","v":9},{"$f":"COUNTIFS(SÚBOJE!$B:$B,$A35,SÚBOJE!$H:$H,3)+COUNTIFS(SÚBOJE!$C:$C,$A35,SÚBOJE!$I:$I,3)","v":2},{"$f":"COUNTIFS(SÚBOJE!$B:$B,$A35,SÚBOJE!$H:$H,1.5)+COUNTIFS(SÚBOJE!$C:$C,$A35,SÚBOJE!$I:$I,1.5)","v":2},{"$f":"SUMIF(TABULKA!$A$3:$A$52,$A35,TABULKA!$K$3:$K$52)","v":17}]
[13,{"$f":"IF(A36<=ZREBOVANIE!$M$1,VLOOKUP(A36,RYBARI!A:C,3,0),\"x\")","v":"Kemencik Zoltán"},{"$f":"SUMIFS(SÚBOJE!$H:$H,SÚBOJE!$A:$A,C$2,SÚBOJE!$B:$B,$A36)+SUMIFS(SÚBOJE!$I:$I,SÚBOJE!$A:$A,C$2,SÚBOJE!$C:$C,$A36)","v":0},{"$f":"SUMIFS(SÚBOJE!$H:$H,SÚBOJE!$A:$A,D$2,SÚBOJE!$B:$B,$A36)+SUMIFS(SÚBOJE!$I:$I,SÚBOJE!$A:$A,D$2,SÚBOJE!$C:$C,$A36)","v":1.5},{"$f":"SUMIFS(SÚBOJE!$H:$H,SÚBOJE!$A:$A,E$2,SÚBOJE!$B:$B,$A36)+SUMIFS(SÚBOJE!$I:$I,SÚBOJE!$A:$A,E$2,SÚBOJE!$C:$C,$A36)","v":0},{"$f":"SUMIFS(SÚBOJE!$H:$H,SÚBOJE!$A:$A,F$2,SÚBOJE!$B:$B,$A36)+SUMIFS(SÚBOJE!$I:$I,SÚBOJE!$A:$A,F$2,SÚBOJE!$C:$C,$A36)","v":0},{"$f":"SUMIFS(SÚBOJE!$H:$H,SÚBOJE!$A:$A,G$2,SÚBOJE!$B:$B,$A36)+SUMIFS(SÚBOJE!$I:$I,SÚBOJE!$A:$A,G$2,SÚBOJE!$C:$C,$A36)","v":3},{"$f":"SUMIFS(SÚBOJE!$H:$H,SÚBOJE!$A:$A,H$2,SÚBOJE!$B:$B,$A36)+SUMIFS(SÚBOJE!$I:$I,SÚBOJE!$A:$A,H$2,SÚBOJE!$C:$C,$A36)","v":3},{"$f":"SUMIFS(SÚBOJE!$H:$H,SÚBOJE!$A:$A,I$2,SÚBOJE!$B:$B,$A36)+SUMIFS(SÚBOJE!$I:$I,SÚBOJE!$A:$A,I$2,SÚBOJE!$C:$C,$A36)","v":0},{"$f":"SUMIFS(SÚBOJE!$H:$H,SÚBOJE!$A:$A,J$2,SÚBOJE!$B:$B,$A36)+SUMIFS(SÚBOJE!$I:$I,SÚBOJE!$A:$A,J$2,SÚBOJE!$C:$C,$A36)","v":1.5},9,{"$f":"COUNTIFS(SÚBOJE!$B:$B,$A36,SÚBOJE!$H:$H,3)+COUNTIFS(SÚBOJE!$C:$C,$A36,SÚBOJE!$I:$I,3)","v":2},{"$f":"COUNTIFS(SÚBOJE!$B:$B,$A36,SÚBOJE!$H:$H,1.5)+COUNTIFS(SÚBOJE!$C:$C,$A36,SÚBOJE!$I:$I,1.5)","v":2},{"$f":"SUMIF(TABULKA!$A$3:$A$52,$A36,TABULKA!$K$3:$K$52)","v":11}]
[5,{"$f":"IF(A37<=ZREBOVANIE!$M$1,VLOOKUP(A37,RYBARI!A:C,3,0),\"x\")","v":"Vančík Juraj"},{"$f":"SUMIFS(SÚBOJE!$H:$H,SÚBOJE!$A:$A,C$2,SÚBOJE!$B:$B,$A37)+SUMIFS(SÚBOJE!$I:$I,SÚBOJE!$A:$A,C$2,SÚBOJE!$C:$C,$A37)","v":0},{"$f":"SUMIFS(SÚBOJE!$H:$H,SÚBOJE!$A:$A,D$2,SÚBOJE!$B:$B,$A37)+SUMIFS(SÚBOJE!$I:$I,SÚBOJE!$A:$A,D$2,SÚBOJE!$C:$C,$A37)","v":3},{"$f":"SUMIFS(SÚBOJE!$H:$H,SÚBOJE!$A:$A,E$2,SÚBOJE!$B:$B,$A37)+SUMIFS(SÚBOJE!$I:$I,SÚBOJE!$A:$A,E$2,SÚBOJE!$C:$C,$A37)","v":0},{"$f":"SUMIFS(SÚBOJE!$H:$H,SÚBOJE!$A:$A,F$2,SÚBOJE!$B:$B,$A37)+SUMIFS(SÚBOJE!$I:$I,SÚBOJE!$A:$A,F$2,SÚBOJE!$C:$C,$A37)","v":0},{"$f":"SUMIFS(SÚBOJE!$H:$H,SÚBOJE!$A:$A,G$2,SÚBOJE!$B:$B,$A37)+SUMIFS(SÚBOJE!$I:$I,SÚBOJE!$A:$A,G$2,SÚBOJE!$C:$C,$A37)","v":1.5},{"$f":"SUMIFS(SÚBOJE!$H:$H,SÚBOJE!$A:$A,H$2,SÚBOJE!$B:$B,$A37)+SUMIFS(SÚBOJE!$I:$I,SÚBOJE!$A:$A,H$2,SÚBOJE!$C:$C,$A37)","v":0},{"$f":"SUMIFS(SÚBOJE!$H:$H,SÚBOJE!$A:$A,I$2,SÚBOJE!$B:$B,$A37)+SUMIFS(SÚBOJE!$I:$I,SÚBOJE!$A:$A,I$2,SÚBOJE!$C:$C,$A37)","v":1.5},{"$f":"SUMIFS(SÚBOJE!$H:$H,SÚBOJE!$A:$A,J$2,SÚBOJE!$B:$B,$A37)+SUMIFS(SÚBOJE!$I:$I,SÚBOJE!$A:$A,J$2,SÚBOJE!$C:$C,$A37)","v":3},9,{"$f":"COUNTIFS(SÚBOJE!$B:$B,$A37,SÚBOJE!$H:$H,3)+COUNTIFS(SÚBOJE!$C:$C,$A37,SÚBOJE!$I:$I,3)","v":2},{"$f":"COUNTIFS(SÚBOJE!$B:$B,$A37,SÚBOJE!$H:$H,1.5)+COUNTIFS(SÚBOJE!$C:$C,$A37,SÚBOJE!$I:$I,1.5)","v":2},{"$f":"SUMIF(TABULKA!$A$3:$A$52,$A37,TABULKA!$K$3:$K$52)","v":9}]
[36,{"$f":"IF(A38<=ZREBOVANIE!$M$1,VLOOKUP(A38,RYBARI!A:C,3,0),\"x\")","v":"Hrivňák Ivan"},{"$f":"SUMIFS(SÚBOJE!$H:$H,SÚBOJE!$A:$A,C$2,SÚBOJE!$B:$B,$A38)+SUMIFS(SÚBOJE!$I:$I,SÚBOJE!$A:$A,C$2,SÚBOJE!$C:$C,$A38)","v":3},{"$f":"SUMIFS(SÚBOJE!$H:$H,SÚBOJE!$A:$A,D$2,SÚBOJE!$B:$B,$A38)+SUMIFS(SÚBOJE!$I:$I,SÚBOJE!$A:$A,D$2,SÚBOJE!$C:$C,$A38)","v":0},{"$f":"SUMIFS(SÚBOJE!$H:$H,SÚBOJE!$A:$A,E$2,SÚBOJE!$B:$B,$A38)+SUMIFS(SÚBOJE!$I:$I,SÚBOJE!$A:$A,E$2,SÚBOJE!$C:$C,$A38)","v":3},{"$f":"SUMIFS(SÚBOJE!$H:$H,SÚBOJE!$A:$A,F$2,SÚBOJE!$B:$B,$A38)+SUMIFS(SÚBOJE!$I:$I,SÚBOJE!$A:$A,F$2,SÚBOJE!$C:$C,$A38)","v":1.5},{"$f":"SUMIFS(SÚBOJE!$H:$H,SÚBOJE!$A:$A,G$2,SÚBOJE!$B:$B,$A38)+SUMIFS(SÚBOJE!$I:$I,SÚBOJE!$A:$A,G$2,SÚBOJE!$C:$C,$A38)","v":0},{"$f":"SUMIFS(SÚBOJE!$H:$H,SÚBOJE!$A:$A,H$2,SÚBOJE!$B:$B,$A38)+SUMIFS(SÚBOJE!$I:$I,SÚBOJE!$A:$A,H$2,SÚBOJE!$C:$C,$A38)","v":0},{"$f":"SUMIFS(SÚBOJE!$H:$H,SÚBOJE!$A:$A,I$2,SÚBOJE!$B:$B,$A38)+SUMIFS(SÚBOJE!$I:$I,SÚBOJE!$A:$A,I$2,SÚBOJE!$C:$C,$A38)","v":0},{"$f":"SUMIFS(SÚBOJE!$H:$H,SÚBOJE!$A:$A,J$2,SÚBOJE!$B:$B,$A38)+SUMIFS(SÚBOJE!$I:$I,SÚBOJE!$A:$A,J$2,SÚBOJE!$C:$C,$A38)","v":1.5},9,{"$f":"COUNTIFS(SÚBOJE!$B:$B,$A38,SÚBOJE!$H:$H,3)+COUNTIFS(SÚBOJE!$C:$C,$A38,SÚBOJE!$I:$I,3)","v":2},{"$f":"COUNTIFS(SÚBOJE!$B:$B,$A38,SÚBOJE!$H:$H,1.5)+COUNTIFS(SÚBOJE!$C:$C,$A38,SÚBOJE!$I:$I,1.5)","v":2},{"$f":"SUMIF(TABULKA!$A$3:$A$52,$A38,TABULKA!$K$3:$K$52)","v":9}]
[34,{"$f":"IF(A39<=ZREBOVANIE!$M$1,VLOOKUP(A39,RYBARI!A:C,3,0),\"x\")","v":"Pavlíček Ľuboš"},{"$f":"SUMIFS(SÚBOJE!$H:$H,SÚBOJE!$A:$A,C$2,SÚBOJE!$B:$B,$A39)+SUMIFS(SÚBOJE!$I:$I,SÚBOJE!$A:$A,C$2,SÚBOJE!$C:$C,$A39)","v":1.5},{"$f":"SUMIFS(SÚBOJE!$H:$H,SÚBOJE!$A:$A,D$2,SÚBOJE!$B:$B,$A39)+SUMIFS(SÚBOJE!$I:$I,SÚBOJE!$A:$A,D$2,SÚBOJE!$C:$C,$A39)","v":0},{"$f":"SUMIFS(SÚBOJE!$H:$H,SÚBOJE!$A:$A,E$2,SÚBOJE!$B:$B,$A39)+SUMIFS(SÚBOJE!$I:$I,SÚBOJE!$A:$A,E$2,SÚBOJE!$C:$C,$A39)","v":1.5},{"$f":"SUMIFS(SÚBOJE!$H:$H,SÚBOJE!$A:$A,F$2,SÚBOJE!$B:$B,$A39)+SUMIFS(SÚBOJE!$I:$I,SÚBOJE!$A:$A,F$2,SÚBOJE!$C:$C,$A39)","v":0},{"$f":"SUMIFS(SÚBOJE!$H:$H,SÚBOJE!$A:$A,G$2,SÚBOJE!$B:$B,$A39)+SUMIFS(SÚBOJE!$I:$I,SÚBOJE!$A:$A,G$2,SÚBOJE!$C:$C,$A39)","v":1.5},{"$f":"SUMIFS(SÚBOJE!$H:$H,SÚBOJE!$A:$A,H$2,SÚBOJE!$B:$B,$A39)+SUMIFS(SÚBOJE!$I:$I,SÚBOJE!$A:$A,H$2,SÚBOJE!$C:$C,$A39)","v":1.5},{"$f":"SUMIFS(SÚBOJE!$H:$H,SÚBOJE!$A:$A,I$2,SÚBOJE!$B:$B,$A39)+SUMIFS(SÚBOJE!$I:$I,SÚBOJE!$A:$A,I$2,SÚBOJE!$C:$C,$A39)","v":0},{"$f":"SUMIFS(SÚBOJE!$H:$H,SÚBOJE!$A:$A,J$2,SÚBOJE!$B:$B,$A39)+SUMIFS(SÚBOJE!$I:$I,SÚBOJE!$A:$A,J$2,SÚBOJE!$C:$C,$A39)","v":3},9,{"$f":"COUNTIFS(SÚBOJE!$B:$B,$A39,SÚBOJE!$H:$H,3)+COUNTIFS(SÚBOJE!$C:$C,$A39,SÚBOJE!$I:$I,3)","v":1},{"$f":"COUNTIFS(SÚBOJE!$B:$B,$A39,SÚBOJE!$H:$H,1.5)+COUNTIFS(SÚBOJE!$C:$C,$A39,SÚBOJE!$I:$I,1.5)","v":4},{"$f":"SUMIF(TABULKA!$A$3:$A$52,$A39,TABULKA!$K$3:$K$52)","v":14}]
[8,{"$f":"IF(A40<=ZREBOVANIE!$M$1,VLOOKUP(A40,RYBARI!A:C,3,0),\"x\")","v":"Kochan Ladislav"},{"$f":"SUMIFS(SÚBOJE!$H:$H,SÚBOJE!$A:$A,C$2,SÚBOJE!$B:$B,$A40)+SUMIFS(SÚBOJE!$I:$I,SÚBOJE!$A:$A,C$2,SÚBOJE!$C:$C,$A40)","v":3},{"$f":"SUMIFS(SÚBOJE!$H:$H,SÚBOJE!$A:$A,D$2,SÚBOJE!$B:$B,$A40)+SUMIFS(SÚBOJE!$I:$I,SÚBOJE!$A:$A,D$2,SÚBOJE!$C:$C,$A40)","v":1},{"$f":"SUMIFS(SÚBOJE!$H:$H,SÚBOJE!$A:$A,E$2,SÚBOJE!$B:$B,$A40)+SUMIFS(SÚBOJE!$I:$I,SÚBOJE!$A:$A,E$2,SÚBOJE!$C:$C,$A40)","v":0},{"$f":"SUMIFS(SÚBOJE!$H:$H,SÚBOJE!$A:$A,F$2,SÚBOJE!$B:$B,$A40)+SUMIFS(SÚBOJE!$I:$I,SÚBOJE!$A:$A,F$2,SÚBOJE!$C:$C,$A40)","v":1.5},{"$f":"SUMIFS(SÚBOJE!$H:$H,SÚBOJE!$A:$A,G$2,SÚBOJE!$B:$B,$A40)+SUMIFS(SÚBOJE!$I:$I,SÚBOJE!$A:$A,G$2,SÚBOJE!$C:$C,$A40)","v":0},{"$f":"SUMIFS(SÚBOJE!$H:$H,SÚBOJE!$A:$A,H$2,SÚBOJE!$B:$B,$A40)+SUMIFS(SÚBOJE!$I:$I,SÚBOJE!$A:$A,H$2,SÚBOJE!$C:$C,$A40)","v":0},{"$f":"SUMIFS(SÚBOJE!$H:$H,SÚBOJE!$A:$A,I$2,SÚBOJE!$B:$B,$A40)+SUMIFS(SÚBOJE!$I:$I,SÚBOJE!$A:$A,I$2,SÚBOJE!$C:$C,$A40)","v":0},{"$f":"SUMIFS(SÚBOJE!$H:$H,SÚBOJE!$A:$A,J$2,SÚBOJE!$B:$B,$A40)+SUMIFS(SÚBOJE!$I:$I,SÚBOJE!$A:$A,J$2,SÚBOJE!$C:$C,$A40)","v":3},8.5,{"$f":"COUNTIFS(SÚBOJE!$B:$B,$A40,SÚBOJE!$H:$H,3)+COUNTIFS(SÚBOJE!$C:$C,$A40,SÚBOJE!$I:$I,3)","v":2},{"$f":"COUNTIFS(SÚBOJE!$B:$B,$A40,SÚBOJE!$H:$H,1.5)+COUNTIFS(SÚBOJE!$C:$C,$A40,SÚBOJE!$I:$I,1.5)","v":1},{"$f":"SUMIF(TABULKA!$A$3:$A$52,$A40,TABULKA!$K$3:$K$52)","v":11}]
[23,{"$f":"IF(A41<=ZREBOVANIE!$M$1,VLOOKUP(A41,RYBARI!A:C,3,0),\"x\")","v":"Beňo Gabriel"},{"$f":"SUMIFS(SÚBOJE!$H:$H,SÚBOJE!$A:$A,C$2,SÚBOJE!$B:$B,$A41)+SUMIFS(SÚBOJE!$I:$I,SÚBOJE!$A:$A,C$2,SÚBOJE!$C:$C,$A41)","v":0},{"$f":"SUMIFS(SÚBOJE!$H:$H,SÚBOJE!$A:$A,D$2,SÚBOJE!$B:$B,$A41)+SUMIFS(SÚBOJE!$I:$I,SÚBOJE!$A:$A,D$2,SÚBOJE!$C:$C,$A41)","v":0},{"$f":"SUMIFS(SÚBOJE!$H:$H,SÚBOJE!$A:$A,E$2,SÚBOJE!$B:$B,$A41)+SUMIFS(SÚBOJE!$I:$I,SÚBOJE!$A:$A,E$2,SÚBOJE!$C:$C,$A41)","v":0},{"$f":"SUMIFS(SÚBOJE!$H:$H,SÚBOJE!$A:$A,F$2,SÚBOJE!$B:$B,$A41)+SUMIFS(SÚBOJE!$I:$I,SÚBOJE!$A:$A,F$2,SÚBOJE!$C:$C,$A41)","v":0},{"$f":"SUMIFS(SÚBOJE!$H:$H,SÚBOJE!$A:$A,G$2,SÚBOJE!$B:$B,$A41)+SUMIFS(SÚBOJE!$I:$I,SÚBOJE!$A:$A,G$2,SÚBOJE!$C:$C,$A41)","v":1.5},{"$f":"SUMIFS(SÚBOJE!$H:$H,SÚBOJE!$A:$A,H$2,SÚBOJE!$B:$B,$A41)+SUMIFS(SÚBOJE!$I:$I,SÚBOJE!$A:$A,H$2,SÚBOJE!$C:$C,$A41)","v":0},{"$f":"SUMIFS(SÚBOJE!$H:$H,SÚBOJE!$A:$A,I$2,SÚBOJE!$B:$B,$A41)+SUMIFS(SÚBOJE!$I:$I,SÚBOJE!$A:$A,I$2,SÚBOJE!$C:$C,$A41)","v":3},{"$f":"SUMIFS(SÚBOJE!$H:$H,SÚBOJE!$A:$A,J$2,SÚBOJE!$B:$B,$A41)+SUMIFS(SÚBOJE!$I:$I,SÚBOJE!$A:$A,J$2,SÚBOJE!$C:$C,$A41)","v":3},7.5,{"$f":"COUNTIFS(SÚBOJE!$B:$B,$A41,SÚBOJE!$H:$H,3)+COUNTIFS(SÚBOJE!$C:$C,$A41,SÚBOJE!$I:$I,3)","v":2},{"$f":"COUNTIFS(SÚBOJE!$B:$B,$A41,SÚBOJE!$H:$H,1.5)+COUNTIFS(SÚBOJE!$C:$C,$A41,SÚBOJE!$I:$I,1.5)","v":1},{"$f":"SUMIF(TABULKA!$A$3:$A$52,$A41,TABULKA!$K$3:$K$52)","v":15}]
[44,{"$f":"IF(A42<=ZREBOVANIE!$M$1,VLOOKUP(A42,RYBARI!A:C,3,0),\"x\")","v":"Pisarovič Erik"},{"$f":"SUMIFS(SÚBOJE!$H:$H,SÚBOJE!$A:$A,C$2,SÚBOJE!$B:$B,$A42)+SUMIFS(SÚBOJE!$I:$I,SÚBOJE!$A:$A,C$2,SÚBOJE!$C:$C,$A42)","v":0},{"$f":"SUMIFS(SÚBOJE!$H:$H,SÚBOJE!$A:$A,D$2,SÚBOJE!$B:$B,$A42)+SUMIFS(SÚBOJE!$I:$I,SÚBOJE!$A:$A,D$2,SÚBOJE!$C:$C,$A42)","v":0},{"$f":"SUMIFS(SÚBOJE!$H:$H,SÚBOJE!$A:$A,E$2,SÚBOJE!$B:$B,$A42)+SUMIFS(SÚBOJE!$I:$I,SÚBOJE!$A:$A,E$2,SÚBOJE!$C:$C,$A42)","v":0},{"$f":"SUMIFS(SÚBOJE!$H:$H,SÚBOJE!$A:$A,F$2,SÚBOJE!$B:$B,$A42)+SUMIFS(SÚBOJE!$I:$I,SÚBOJE!$A:$A,F$2,SÚBOJE!$C:$C,$A42)","v":0},{"$f":"SUMIFS(SÚBOJE!$H:$H,SÚBOJE!$A:$A,G$2,SÚBOJE!$B:$B,$A42)+SUMIFS(SÚBOJE!$I:$I,SÚBOJE!$A:$A,G$2,SÚBOJE!$C:$C,$A42)","v":3},{"$f":"SUMIFS(SÚBOJE!$H:$H,SÚBOJE!$A:$A,H$2,SÚBOJE!$B:$B,$A42)+SUMIFS(SÚBOJE!$I:$I,SÚBOJE!$A:$A,H$2,SÚBOJE!$C:$C,$A42)","v":1.5},{"$f":"SUMIFS(SÚBOJE!$H:$H,SÚBOJE!$A:$A,I$2,SÚBOJE!$B:$B,$A42)+SUMIFS(SÚBOJE!$I:$I,SÚBOJE!$A:$A,I$2,SÚBOJE!$C:$C,$A42)","v":3},{"$f":"SUMIFS(SÚBOJE!$H:$H,SÚBOJE!$A:$A,J$2,SÚBOJE!$B:$B,$A42)+SUMIFS(SÚBOJE!$I:$I,SÚBOJE!$A:$A,J$2,SÚBOJE!$C:$C,$A42)","v":0},7.5,{"$f":"COUNTIFS(SÚBOJE!$B:$B,$A42,SÚBOJE!$H:$H,3)+COUNTIFS(SÚBOJE!$C:$C,$A42,SÚBOJE!$I:$I,3)","v":2},{"$f":"COUNTIFS(SÚBOJE!$B:$B,$A42,SÚBOJE!$H:$H,1.5)+COUNTIFS(SÚBOJE!$C:$C,$A42,SÚBOJE!$I:$I,1.5)","v":1},{"$f":"SUMIF(TABULKA!$A$3:$A$52,$A42,TABULKA!$K$3:$K$52)","v":13}]
[19,{"$f":"IF(A43<=ZREBOVANIE!$M$1,VLOOKUP(A43,RYBARI!A:C,3,0),\"x\")","v":"Hornák Filip"},{"$f":"SUMIFS(SÚBOJE!$H:$H,SÚBOJE!$A:$A,C$2,SÚBOJE!$B:$B,$A43)+SUMIFS(SÚBOJE!$I:$I,SÚBOJE!$A:$A,C$2,SÚBOJE!$C:$C,$A43)","v":0},{"$f":"SUMIFS(SÚBOJE!$H:$H,SÚBOJE!$A:$A,D$2,SÚBOJE!$B:$B,$A43)+SUMIFS(SÚBOJE!$I:$I,SÚBOJE!$A:$A,D$2,SÚBOJE!$C:$C,$A43)","v":3},{"$f":"SUMIFS(SÚBOJE!$H:$H,SÚBOJE!$A:$A,E$2,SÚBOJE!$B:$B,$A43)+SUMIFS(SÚBOJE!$I:$I,SÚBOJE!$A:$A,E$2,SÚBOJE!$C:$C,$A43)","v":0},{"$f":"SUMIFS(SÚBOJE!$H:$H,SÚBOJE!$A:$A,F$2,SÚBOJE!$B:$B,$A43)+SUMIFS(SÚBOJE!$I:$I,SÚBOJE!$A:$A,F$2,SÚBOJE!$C:$C,$A43)","v":1.5},{"$f":"SUMIFS(SÚBOJE!$H:$H,SÚBOJE!$A:$A,G$2,SÚBOJE!$B:$B,$A43)+SUMIFS(SÚBOJE!$I:$I,SÚBOJE!$A:$A,G$2,SÚBOJE!$C:$C,$A43)","v":3},{"$f":"SUMIFS(SÚBOJE!$H:$H,SÚBOJE!$A:$A,H$2,SÚBOJE!$B:$B,$A43)+SUMIFS(SÚBOJE!$I:$I,SÚBOJE!$A:$A,H$2,SÚBOJE!$C:$C,$A43)","v":0},{"$f":"SUMIFS(SÚBOJE!$H:$H,SÚBOJE!$A:$A,I$2,SÚBOJE!$B:$B,$A43)+SUMIFS(SÚBOJE!$I:$I,SÚBOJE!$A:$A,I$2,SÚBOJE!$C:$C,$A43)","v":0},{"$f":"SUMIFS(SÚBOJE!$H:$H,SÚBOJE!$A:$A,J$2,SÚBOJE!$B:$B,$A43)+SUMIFS(SÚBOJE!$I:$I,SÚBOJE!$A:$A,J$2,SÚBOJE!$C:$C,$A43)","v":0},7.5,{"$f":"COUNTIFS(SÚBOJE!$B:$B,$A43,SÚBOJE!$H:$H,3)+COUNTIFS(SÚBOJE!$C:$C,$A43,SÚBOJE!$I:$I,3)","v":2},{"$f":"COUNTIFS(SÚBOJE!$B:$B,$A43,SÚBOJE!$H:$H,1.5)+COUNTIFS(SÚBOJE!$C:$C,$A43,SÚBOJE!$I:$I,1.5)","v":1},{"$f":"SUMIF(TABULKA!$A$3:$A$52,$A43,TABULKA!$K$3:$K$52)","v":5}]
[31,{"$f":"IF(A44<=ZREBOVANIE!$M$1,VLOOKUP(A44,RYBARI!A:C,3,0),\"x\")","v":"Sýkora Jozef"},{"$f":"SUMIFS(SÚBOJE!$H:$H,SÚBOJE!$A:$A,C$2,SÚBOJE!$B:$B,$A44)+SUMIFS(SÚBOJE!$I:$I,SÚBOJE!$A:$A,C$2,SÚBOJE!$C:$C,$A44)","v":0},{"$f":"SUMIFS(SÚBOJE!$H:$H,SÚBOJE!$A:$A,D$2,SÚBOJE!$B:$B,$A44)+SUMIFS(SÚBOJE!$I:$I,SÚBOJE!$A:$A,D$2,SÚBOJE!$C:$C,$A44)","v":0},{"$f":"SUMIFS(SÚBOJE!$H:$H,SÚBOJE!$A:$A,E$2,SÚBOJE!$B:$B,$A44)+SUMIFS(SÚBOJE!$I:$I,SÚBOJE!$A:$A,E$2,SÚBOJE!$C:$C,$A44)","v":0},{"$f":"SUMIFS(SÚBOJE!$H:$H,SÚBOJE!$A:$A,F$2,SÚBOJE!$B:$B,$A44)+SUMIFS(SÚBOJE!$I:$I,SÚBOJE!$A:$A,F$2,SÚBOJE!$C:$C,$A44)","v":0},{"$f":"SUMIFS(SÚBOJE!$H:$H,SÚBOJE!$A:$A,G$2,SÚBOJE!$B:$B,$A44)+SUMIFS(SÚBOJE!$I:$I,SÚBOJE!$A:$A,G$2,SÚBOJE!$C:$C,$A44)","v":1.5},{"$f":"SUMIFS(SÚBOJE!$H:$H,SÚBOJE!$A:$A,H$2,SÚBOJE!$B:$B,$A44)+SUMIFS(SÚBOJE!$I:$I,SÚBOJE!$A:$A,H$2,SÚBOJE!$C:$C,$A44)","v":0},{"$f":"SUMIFS(SÚBOJE!$H:$H,SÚBOJE!$A:$A,I$2,SÚBOJE!$B:$B,$A44)+SUMIFS(SÚBOJE!$I:$I,SÚBOJE!$A:$A,I$2,SÚBOJE!$C:$C,$A44)","v":3},{"$f":"SUMIFS(SÚBOJE!$H:$H,SÚBOJE!$A:$A,J$2,SÚBOJE!$B:$B,$A44)+SUMIFS(SÚBOJE!$I:$I,SÚBOJE!$A:$A,J$2,SÚBOJE!$C:$C,$A44)","v":1.5},6,{"$f":"COUNTIFS(SÚBOJE!$B:$B,$A44,SÚBOJE!$H:$H,3)+COUNTIFS(SÚBOJE!$C:$C,$A44,SÚBOJE!$I:$I,3)","v":1},{"$f":"COUNTIFS(SÚBOJE!$B:$B,$A44,SÚBOJE!$H:$H,1.5)+COUNTIFS(SÚBOJE!$C:$C,$A44,SÚBOJE!$I:$I,1.5)","v":2},{"$f":"SUMIF(TABULKA!$A$3:$A$52,$A44,TABULKA!$K$3:$K$52)","v":7}]
[33,{"$f":"IF(A45<=ZREBOVANIE!$M$1,VLOOKUP(A45,RYBARI!A:C,3,0),\"x\")","v":"Florek Tomáš"},{"$f":"SUMIFS(SÚBOJE!$H:$H,SÚBOJE!$A:$A,C$2,SÚBOJE!$B:$B,$A45)+SUMIFS(SÚBOJE!$I:$I,SÚBOJE!$A:$A,C$2,SÚBOJE!$C:$C,$A45)","v":1.5},{"$f":"SUMIFS(SÚBOJE!$H:$H,SÚBOJE!$A:$A,D$2,SÚBOJE!$B:$B,$A45)+SUMIFS(SÚBOJE!$I:$I,SÚBOJE!$A:$A,D$2,SÚBOJE!$C:$C,$A45)","v":0},{"$f":"SUMIFS(SÚBOJE!$H:$H,SÚBOJE!$A:$A,E$2,SÚBOJE!$B:$B,$A45)+SUMIFS(SÚBOJE!$I:$I,SÚBOJE!$A:$A,E$2,SÚBOJE!$C:$C,$A45)","v":0},{"$f":"SUMIFS(SÚBOJE!$H:$H,SÚBOJE!$A:$A,F$2,SÚBOJE!$B:$B,$A45)+SUMIFS(SÚBOJE!$I:$I,SÚBOJE!$A:$A,F$2,SÚBOJE!$C:$C,$A45)","v":0},{"$f":"SUMIFS(SÚBOJE!$H:$H,SÚBOJE!$A:$A,G$2,SÚBOJE!$B:$B,$A45)+SUMIFS(SÚBOJE!$I:$I,SÚBOJE!$A:$A,G$2,SÚBOJE!$C:$C,$A45)","v":1.5},{"$f":"SUMIFS(SÚBOJE!$H:$H,SÚBOJE!$A:$A,H$2,SÚBOJE!$B:$B,$A45)+SUMIFS(SÚBOJE!$I:$I,SÚBOJE!$A:$A,H$2,SÚBOJE!$C:$C,$A45)","v":1},{"$f":"SUMIFS(SÚBOJE!$H:$H,SÚBOJE!$A:$A,I$2,SÚBOJE!$B:$B,$A45)+SUMIFS(SÚBOJE!$I:$I,SÚBOJE!$A:$A,I$2,SÚBOJE!$C:$C,$A45)","v":0},{"$f":"SUMIFS(SÚBOJE!$H:$H,SÚBOJE!$A:$A,J$2,SÚBOJE!$B:$B,$A45)+SUMIFS(SÚBOJE!$I:$I,SÚBOJE!$A:$A,J$2,SÚBOJE!$C:$C,$A45)","v":0},4,{"$f":"COUNTIFS(SÚBOJE!$B:$B,$A45,SÚBOJE!$H:$H,3)+COUNTIFS(SÚBOJE!$C:$C,$A45,SÚBOJE!$I:$I,3)","v":0},{"$f":"COUNTIFS(SÚBOJE!$B:$B,$A45,SÚBOJE!$H:$H,1.5)+COUNTIFS(SÚBOJE!$C:$C,$A45,SÚBOJE!$I:$I,1.5)","v":2},{"$f":"SUMIF(TABULKA!$A$3:$A$52,$A45,TABULKA!$K$3:$K$52)","v":11}]
[17,{"$f":"IF(A46<=ZREBOVANIE!$M$1,VLOOKUP(A46,RYBARI!A:C,3,0),\"x\")","v":"Onofrej Ivan"},{"$f":"SUMIFS(SÚBOJE!$H:$H,SÚBOJE!$A:$A,C$2,SÚBOJE!$B:$B,$A46)+SUMIFS(SÚBOJE!$I:$I,SÚBOJE!$A:$A,C$2,SÚBOJE!$C:$C,$A46)","v":0},{"$f":"SUMIFS(SÚBOJE!$H:$H,SÚBOJE!$A:$A,D$2,SÚBOJE!$B:$B,$A46)+SUMIFS(SÚBOJE!$I:$I,SÚBOJE!$A:$A,D$2,SÚBOJE!$C:$C,$A46)","v":0},{"$f":"SUMIFS(SÚBOJE!$H:$H,SÚBOJE!$A:$A,E$2,SÚBOJE!$B:$B,$A46)+SUMIFS(SÚBOJE!$I:$I,SÚBOJE!$A:$A,E$2,SÚBOJE!$C:$C,$A46)","v":0},{"$f":"SUMIFS(SÚBOJE!$H:$H,SÚBOJE!$A:$A,F$2,SÚBOJE!$B:$B,$A46)+SUMIFS(SÚBOJE!$I:$I,SÚBOJE!$A:$A,F$2,SÚBOJE!$C:$C,$A46)","v":0},{"$f":"SUMIFS(SÚBOJE!$H:$H,SÚBOJE!$A:$A,G$2,SÚBOJE!$B:$B,$A46)+SUMIFS(SÚBOJE!$I:$I,SÚBOJE!$A:$A,G$2,SÚBOJE!$C:$C,$A46)","v":1.5},{"$f":"SUMIFS(SÚBOJE!$H:$H,SÚBOJE!$A:$A,H$2,SÚBOJE!$B:$B,$A46)+SUMIFS(SÚBOJE!$I:$I,SÚBOJE!$A:$A,H$2,SÚBOJE!$C:$C,$A46)","v":0},{"$f":"SUMIFS(SÚBOJE!$H:$H,SÚBOJE!$A:$A,I$2,SÚBOJE!$B:$B,$A46)+SUMIFS(SÚBOJE!$I:$I,SÚBOJE!$A:$A,I$2,SÚBOJE!$C:$C,$A46)","v":1.5},{"$f":"SUMIFS(SÚBOJE!$H:$H,SÚBOJE!$A:$A,J$2,SÚBOJE!$B:$B,$A46)+SUMIFS(SÚBOJE!$I:$I,SÚBOJE!$A:$A,J$2,SÚBOJE!$C:$C,$A46)","v":0},3,{"$f":"COUNTIFS(SÚBOJE!$B:$B,$A46,SÚBOJE!$H:$H,3)+COUNTIFS(SÚBOJE!$C:$C,$A46,SÚBOJE!$I:$I,3)","v":0},{"$f":"COUNTIFS(SÚBOJE!$B:$B,$A46,SÚBOJE!$H:$H,1.5)+COUNTIFS(SÚBOJE!$C:$C,$A46,SÚBOJE!$I:$I,1.5)","v":2},{"$f":"SUMIF(TABULKA!$A$3:$A$52,$A46,TABULKA!$K$3:$K$52)","v":14}]
[37,{"$f":"IF(A47<=ZREBOVANIE!$M$1,VLOOKUP(A47,RYBARI!A:C,3,0),\"x\")","v":"Mádr Tomáš"},{"$f":"SUMIFS(SÚBOJE!$H:$H,SÚBOJE!$A:$A,C$2,SÚBOJE!$B:$B,$A47)+SUMIFS(SÚBOJE!$I:$I,SÚBOJE!$A:$A,C$2,SÚBOJE!$C:$C,$A47)","v":0},{"$f":"SUMIFS(SÚBOJE!$H:$H,SÚBOJE!$A:$A,D$2,SÚBOJE!$B:$B,$A47)+SUMIFS(SÚBOJE!$I:$I,SÚBOJE!$A:$A,D$2,SÚBOJE!$C:$C,$A47)","v":0},{"$f":"SUMIFS(SÚBOJE!$H:$H,SÚBOJE!$A:$A,E$2,SÚBOJE!$B:$B,$A47)+SUMIFS(SÚBOJE!$I:$I,SÚBOJE!$A:$A,E$2,SÚBOJE!$C:$C,$A47)","v":0},{"$f":"SUMIFS(SÚBOJE!$H:$H,SÚBOJE!$A:$A,F$2,SÚBOJE!$B:$B,$A47)+SUMIFS(SÚBOJE!$I:$I,SÚBOJE!$A:$A,F$2,SÚBOJE!$C:$C,$A47)","v":0},{"$f":"SUMIFS(SÚBOJE!$H:$H,SÚBOJE!$A:$A,G$2,SÚBOJE!$B:$B,$A47)+SUMIFS(SÚBOJE!$I:$I,SÚBOJE!$A:$A,G$2,SÚBOJE!$C:$C,$A47)","v":0},{"$f":"SUMIFS(SÚBOJE!$H:$H,SÚBOJE!$A:$A,H$2,SÚBOJE!$B:$B,$A47)+SUMIFS(SÚBOJE!$I:$I,SÚBOJE!$A:$A,H$2,SÚBOJE!$C:$C,$A47)","v":1.5},{"$f":"SUMIFS(SÚBOJE!$H:$H,SÚBOJE!$A:$A,I$2,SÚBOJE!$B:$B,$A47)+SUMIFS(SÚBOJE!$I:$I,SÚBOJE!$A:$A,I$2,SÚBOJE!$C:$C,$A47)","v":1.5},{"$f":"SUMIFS(SÚBOJE!$H:$H,SÚBOJE!$A:$A,J$2,SÚBOJE!$B:$B,$A47)+SUMIFS(SÚBOJE!$I:$I,SÚBOJE!$A:$A,J$2,SÚBOJE!$C:$C,$A47)","v":0},3,{"$f":"COUNTIFS(SÚBOJE!$B:$B,$A47,SÚBOJE!$H:$H,3)+COUNTIFS(SÚBOJE!$C:$C,$A47,SÚBOJE!$I:$I,3)","v":0},{"$f":"COUNTIFS(SÚBOJE!$B:$B,$A47,SÚBOJE!$H:$H,1.5)+COUNTIFS(SÚBOJE!$C:$C,$A47,SÚBOJE!$I:$I,1.5)","v":2},{"$f":"SUMIF(TABULKA!$A$3:$A$52,$A47,TABULKA!$K$3:$K$52)","v":6}]
[27,{"$f":"IF(A48<=ZREBOVANIE!$M$1,VLOOKUP(A48,RYBARI!A:C,3,0),\"x\")","v":"Mrázik Juraj"},{"$f":"SUMIFS(SÚBOJE!$H:$H,SÚBOJE!$A:$A,C$2,SÚBOJE!$B:$B,$A48)+SUMIFS(SÚBOJE!$I:$I,SÚBOJE!$A:$A,C$2,SÚBOJE!$C:$C,$A48)","v":0},{"$f":"SUMIFS(SÚBOJE!$H:$H,SÚBOJE!$A:$A,D$2,SÚBOJE!$B:$B,$A48)+SUMIFS(SÚBOJE!$I:$I,SÚBOJE!$A:$A,D$2,SÚBOJE!$C:$C,$A48)","v":1},{"$f":"SUMIFS(SÚBOJE!$H:$H,SÚBOJE!$A:$A,E$2,SÚBOJE!$B:$B,$A48)+SUMIFS(SÚBOJE!$I:$I,SÚBOJE!$A:$A,E$2,SÚBOJE!$C:$C,$A48)","v":0},{"$f":"SUMIFS(SÚBOJE!$H:$H,SÚBOJE!$A:$A,F$2,SÚBOJE!$B:$B,$A48)+SUMIFS(SÚBOJE!$I:$I,SÚBOJE!$A:$A,F$2,SÚBOJE!$C:$C,$A48)","v":0},{"$f":"SUMIFS(SÚBOJE!$H:$H,SÚBOJE!$A:$A,G$2,SÚBOJE!$B:$B,$A48)+SUMIFS(SÚBOJE!$I:$I,SÚBOJE!$A:$A,G$2,SÚBOJE!$C:$C,$A48)","v":0},{"$f":"SUMIFS(SÚBOJE!$H:$H,SÚBOJE!$A:$A,H$2,SÚBOJE!$B:$B,$A48)+SUMIFS(SÚBOJE!$I:$I,SÚBOJE!$A:$A,H$2,SÚBOJE!$C:$C,$A48)","v":1.5},{"$f":"SUMIFS(SÚBOJE!$H:$H,SÚBOJE!$A:$A,I$2,SÚBOJE!$B:$B,$A48)+SUMIFS(SÚBOJE!$I:$I,SÚBOJE!$A:$A,I$2,SÚBOJE!$C:$C,$A48)","v":0},{"$f":"SUMIFS(SÚBOJE!$H:$H,SÚBOJE!$A:$A,J$2,SÚBOJE!$B:$B,$A48)+SUMIFS(SÚBOJE!$I:$I,SÚBOJE!$A:$A,J$2,SÚBOJE!$C:$C,$A48)","v":0},2.5,{"$f":"COUNTIFS(SÚBOJE!$B:$B,$A48,SÚBOJE!$H:$H,3)+COUNTIFS(SÚBOJE!$C:$C,$A48,SÚBOJE!$I:$I,3)","v":0},{"$f":"COUNTIFS(SÚBOJE!$B:$B,$A48,SÚBOJE!$H:$H,1.5)+COUNTIFS(SÚBOJE!$C:$C,$A48,SÚBOJE!$I:$I,1.5)","v":1},{"$f":"SUMIF(TABULKA!$A$3:$A$52,$A48,TABULKA!$K$3:$K$52)","v":5}]
[21,{"$f":"IF(A49<=ZREBOVANIE!$M$1,VLOOKUP(A49,RYBARI!A:C,3,0),\"x\")","v":"Medo Marián"},{"$f":"SUMIFS(SÚBOJE!$H:$H,SÚBOJE!$A:$A,C$2,SÚBOJE!$B:$B,$A49)+SUMIFS(SÚBOJE!$I:$I,SÚBOJE!$A:$A,C$2,SÚBOJE!$C:$C,$A49)","v":0},{"$f":"SUMIFS(SÚBOJE!$H:$H,SÚBOJE!$A:$A,D$2,SÚBOJE!$B:$B,$A49)+SUMIFS(SÚBOJE!$I:$I,SÚBOJE!$A:$A,D$2,SÚBOJE!$C:$C,$A49)","v":1},{"$f":"SUMIFS(SÚBOJE!$H:$H,SÚBOJE!$A:$A,E$2,SÚBOJE!$B:$B,$A49)+SUMIFS(SÚBOJE!$I:$I,SÚBOJE!$A:$A,E$2,SÚBOJE!$C:$C,$A49)","v":0},{"$f":"SUMIFS(SÚBOJE!$H:$H,SÚBOJE!$A:$A,F$2,SÚBOJE!$B:$B,$A49)+SUMIFS(SÚBOJE!$I:$I,SÚBOJE!$A:$A,F$2,SÚBOJE!$C:$C,$A49)","v":0},{"$f":"SUMIFS(SÚBOJE!$H:$H,SÚBOJE!$A:$A,G$2,SÚBOJE!$B:$B,$A49)+SUMIFS(SÚBOJE!$I:$I,SÚBOJE!$A:$A,G$2,SÚBOJE!$C:$C,$A49)","v":0},{"$f":"SUMIFS(SÚBOJE!$H:$H,SÚBOJE!$A:$A,H$2,SÚBOJE!$B:$B,$A49)+SUMIFS(SÚBOJE!$I:$I,SÚBOJE!$A:$A,H$2,SÚBOJE!$C:$C,$A49)","v":0},{"$f":"SUMIFS(SÚBOJE!$H:$H,SÚBOJE!$A:$A,I$2,SÚBOJE!$B:$B,$A49)+SUMIFS(SÚBOJE!$I:$I,SÚBOJE!$A:$A,I$2,SÚBOJE!$C:$C,$A49)","v":0},{"$f":"SUMIFS(SÚBOJE!$H:$H,SÚBOJE!$A:$A,J$2,SÚBOJE!$B:$B,$A49)+SUMIFS(SÚBOJE!$I:$I,SÚBOJE!$A:$A,J$2,SÚBOJE!$C:$C,$A49)","v":0},1,{"$f":"COUNTIFS(SÚBOJE!$B:$B,$A49,SÚBOJE!$H:$H,3)+COUNTIFS(SÚBOJE!$C:$C,$A49,SÚBOJE!$I:$I,3)","v":0},{"$f":"COUNTIFS(SÚBOJE!$B:$B,$A49,SÚBOJE!$H:$H,1.5)+COUNTIFS(SÚBOJE!$C:$C,$A49,SÚBOJE!$I:$I,1.5)","v":0},{"$f":"SUMIF(TABULKA!$A$3:$A$52,$A49,TABULKA!$K$3:$K$52)","v":10}]
[48,{"$f":"IF(A50<=ZREBOVANIE!$M$1,VLOOKUP(A50,RYBARI!A:C,3,0),\"x\")","v":"x"},{"$f":"SUMIFS(SÚBOJE!$H:$H,SÚBOJE!$A:$A,C$2,SÚBOJE!$B:$B,$A50)+SUMIFS(SÚBOJE!$I:$I,SÚBOJE!$A:$A,C$2,SÚBOJE!$C:$C,$A50)","v":0},{"$f":"SUMIFS(SÚBOJE!$H:$H,SÚBOJE!$A:$A,D$2,SÚBOJE!$B:$B,$A50)+SUMIFS(SÚBOJE!$I:$I,SÚBOJE!$A:$A,D$2,SÚBOJE!$C:$C,$A50)","v":0},{"$f":"SUMIFS(SÚBOJE!$H:$H,SÚBOJE!$A:$A,E$2,SÚBOJE!$B:$B,$A50)+SUMIFS(SÚBOJE!$I:$I,SÚBOJE!$A:$A,E$2,SÚBOJE!$C:$C,$A50)","v":0},{"$f":"SUMIFS(SÚBOJE!$H:$H,SÚBOJE!$A:$A,F$2,SÚBOJE!$B:$B,$A50)+SUMIFS(SÚBOJE!$I:$I,SÚBOJE!$A:$A,F$2,SÚBOJE!$C:$C,$A50)","v":0},{"$f":"SUMIFS(SÚBOJE!$H:$H,SÚBOJE!$A:$A,G$2,SÚBOJE!$B:$B,$A50)+SUMIFS(SÚBOJE!$I:$I,SÚBOJE!$A:$A,G$2,SÚBOJE!$C:$C,$A50)","v":0},{"$f":"SUMIFS(SÚBOJE!$H:$H,SÚBOJE!$A:$A,H$2,SÚBOJE!$B:$B,$A50)+SUMIFS(SÚBOJE!$I:$I,SÚBOJE!$A:$A,H$2,SÚBOJE!$C:$C,$A50)","v":0},{"$f":"SUMIFS(SÚBOJE!$H:$H,SÚBOJE!$A:$A,I$2,SÚBOJE!$B:$B,$A50)+SUMIFS(SÚBOJE!$I:$I,SÚBOJE!$A:$A,I$2,SÚBOJE!$C:$C,$A50)","v":0},{"$f":"SUMIFS(SÚBOJE!$H:$H,SÚBOJE!$A:$A,J$2,SÚBOJE!$B:$B,$A50)+SUMIFS(SÚBOJE!$I:$I,SÚBOJE!$A:$A,J$2,SÚBOJE!$C:$C,$A50)","v":0},0,{"$f":"COUNTIFS(SÚBOJE!$B:$B,$A50,SÚBOJE!$H:$H,3)+COUNTIFS(SÚBOJE!$C:$C,$A50,SÚBOJE!$I:$I,3)","v":0},{"$f":"COUNTIFS(SÚBOJE!$B:$B,$A50,SÚBOJE!$H:$H,1.5)+COUNTIFS(SÚBOJE!$C:$C,$A50,SÚBOJE!$I:$I,1.5)","v":0},{"$f":"SUMIF(TABULKA!$A$3:$A$52,$A50,TABULKA!$K$3:$K$52)","v":0}]
[49,{"$f":"IF(A51<=ZREBOVANIE!$M$1,VLOOKUP(A51,RYBARI!A:C,3,0),\"x\")","v":"x"},{"$f":"SUMIFS(SÚBOJE!$H:$H,SÚBOJE!$A:$A,C$2,SÚBOJE!$B:$B,$A51)+SUMIFS(SÚBOJE!$I:$I,SÚBOJE!$A:$A,C$2,SÚBOJE!$C:$C,$A51)","v":0},{"$f":"SUMIFS(SÚBOJE!$H:$H,SÚBOJE!$A:$A,D$2,SÚBOJE!$B:$B,$A51)+SUMIFS(SÚBOJE!$I:$I,SÚBOJE!$A:$A,D$2,SÚBOJE!$C:$C,$A51)","v":0},{"$f":"SUMIFS(SÚBOJE!$H:$H,SÚBOJE!$A:$A,E$2,SÚBOJE!$B:$B,$A51)+SUMIFS(SÚBOJE!$I:$I,SÚBOJE!$A:$A,E$2,SÚBOJE!$C:$C,$A51)","v":0},{"$f":"SUMIFS(SÚBOJE!$H:$H,SÚBOJE!$A:$A,F$2,SÚBOJE!$B:$B,$A51)+SUMIFS(SÚBOJE!$I:$I,SÚBOJE!$A:$A,F$2,SÚBOJE!$C:$C,$A51)","v":0},{"$f":"SUMIFS(SÚBOJE!$H:$H,SÚBOJE!$A:$A,G$2,SÚBOJE!$B:$B,$A51)+SUMIFS(SÚBOJE!$I:$I,SÚBOJE!$A:$A,G$2,SÚBOJE!$C:$C,$A51)","v":0},{"$f":"SUMIFS(SÚBOJE!$H:$H,SÚBOJE!$A:$A,H$2,SÚBOJE!$B:$B,$A51)+SUMIFS(SÚBOJE!$I:$I,SÚBOJE!$A:$A,H$2,SÚBOJE!$C:$C,$A51)","v":0},{"$f":"SUMIFS(SÚBOJE!$H:$H,SÚBOJE!$A:$A,I$2,SÚBOJE!$B:$B,$A51)+SUMIFS(SÚBOJE!$I:$I,SÚBOJE!$A:$A,I$2,SÚBOJE!$C:$C,$A51)","v":0},{"$f":"SUMIFS(SÚBOJE!$H:$H,SÚBOJE!$A:$A,J$2,SÚBOJE!$B:$B,$A51)+SUMIFS(SÚBOJE!$I:$I,SÚBOJE!$A:$A,J$2,SÚBOJE!$C:$C,$A51)","v":0},0,{"$f":"COUNTIFS(SÚBOJE!$B:$B,$A51,SÚBOJE!$H:$H,3)+COUNTIFS(SÚBOJE!$C:$C,$A51,SÚBOJE!$I:$I,3)","v":0},{"$f":"COUNTIFS(SÚBOJE!$B:$B,$A51,SÚBOJE!$H:$H,1.5)+COUNTIFS(SÚBOJE!$C:$C,$A51,SÚBOJE!$I:$I,1.5)","v":0},{"$f":"SUMIF(TABULKA!$A$3:$A$52,$A51,TABULKA!$K$3:$K$52)","v":0}]
[50,{"$f":"IF(A52<=ZREBOVANIE!$M$1,VLOOKUP(A52,RYBARI!A:C,3,0),\"x\")","v":"x"},{"$f":"SUMIFS(SÚBOJE!$H:$H,SÚBOJE!$A:$A,C$2,SÚBOJE!$B:$B,$A52)+SUMIFS(SÚBOJE!$I:$I,SÚBOJE!$A:$A,C$2,SÚBOJE!$C:$C,$A52)","v":0},{"$f":"SUMIFS(SÚBOJE!$H:$H,SÚBOJE!$A:$A,D$2,SÚBOJE!$B:$B,$A52)+SUMIFS(SÚBOJE!$I:$I,SÚBOJE!$A:$A,D$2,SÚBOJE!$C:$C,$A52)","v":0},{"$f":"SUMIFS(SÚBOJE!$H:$H,SÚBOJE!$A:$A,E$2,SÚBOJE!$B:$B,$A52)+SUMIFS(SÚBOJE!$I:$I,SÚBOJE!$A:$A,E$2,SÚBOJE!$C:$C,$A52)","v":0},{"$f":"SUMIFS(SÚBOJE!$H:$H,SÚBOJE!$A:$A,F$2,SÚBOJE!$B:$B,$A52)+SUMIFS(SÚBOJE!$I:$I,SÚBOJE!$A:$A,F$2,SÚBOJE!$C:$C,$A52)","v":0},{"$f":"SUMIFS(SÚBOJE!$H:$H,SÚBOJE!$A:$A,G$2,SÚBOJE!$B:$B,$A52)+SUMIFS(SÚBOJE!$I:$I,SÚBOJE!$A:$A,G$2,SÚBOJE!$C:$C,$A52)","v":0},{"$f":"SUMIFS(SÚBOJE!$H:$H,SÚBOJE!$A:$A,H$2,SÚBOJE!$B:$B,$A52)+SUMIFS(SÚBOJE!$I:$I,SÚBOJE!$A:$A,H$2,SÚBOJE!$C:$C,$A52)","v":0},{"$f":"SUMIFS(SÚBOJE!$H:$H,SÚBOJE!$A:$A,I$2,SÚBOJE!$B:$B,$A52)+SUMIFS(SÚBOJE!$I:$I,SÚBOJE!$A:$A,I$2,SÚBOJE!$C:$C,$A52)","v":0},{"$f":"SUMIFS(SÚBOJE!$H:$H,SÚBOJE!$A:$A,J$2,SÚBOJE!$B:$B,$A52)+SUMIFS(SÚBOJE!$I:$I,SÚBOJE!$A:$A,J$2,SÚBOJE!$C:$C,$A52)","v":0},0,{"$f":"COUNTIFS(SÚBOJE!$B:$B,$A52,SÚBOJE!$H:$H,3)+COUNTIFS(SÚBOJE!$C:$C,$A52,SÚBOJE!$I:$I,3)","v":0},{"$f":"COUNTIFS(SÚBOJE!$B:$B,$A52,SÚBOJE!$H:$H,1.5)+COUNTIFS(SÚBOJE!$C:$C,$A52,SÚBOJE!$I:$I,1.5)","v":0},{"$f":"SUMIF(TABULKA!$A$3:$A$52,$A52,TABULKA!$K$3:$K$52)","v":0}]

{"sheet":"varianty","index":6,"n_rows":86,"n_cols":2,"rows_kept":86,"cut":false,"hidden":true,"merged":[]}
["závodníků","posun"]
[30,2]
[30,3]
[30,4]
[30,8]
[30,9]
[31,2]
[31,6]
[31,10]
[32,2]
[32,6]
[32,10]
[33,2]
[34,2]
[34,3]
[34,4]
[34,6]
[34,8]
[34,9]
[34,10]
[35,2]
[35,4]
[35,8]
[35,10]
[36,2]
[36,4]
[36,8]
[36,10]
[37,2]
[38,2]
[38,4]
[38,5]
[38,6]
[38,8]
[38,9]
[38,10]
[39,2]
[39,6]
[40,2]
[40,6]
[41,2]
[41,8]
[42,2]
[42,3]
[42,4]
[42,5]
[42,8]
[42,9]
[42,10]
[43,2]
[43,4]
[43,6]
[43,8]
[43,10]
[44,2]
[44,3]
[44,4]
[44,6]
[44,7]
[44,8]
[44,10]
[45,2]
[46,2]
[46,3]
[46,4]
[46,5]
[46,6]
[46,7]
[46,8]
[46,9]
[46,10]
[47,2]
[47,10]
[48,2]
[48,3]
[48,9]
[48,10]
[49,2]
[50,2]
[50,3]
[50,4]
[50,5]
[50,6]
[50,7]
[50,8]
[50,9]