{"text_format":"1","workbook":"xlsx","n_sheets":7,"sheets":["RYBARI","seznam","ZREBOVANIE","TABULKA","SÚBOJE","BODY","varianty"],"not_rendered":{"charts":0,"images":0,"macros":1,"external_links":0,"defined_names":2,"comments":0,"pivot_tables":0},"unopened":[],"bounds":{"document_bytes":16777216,"sheet_cells":100000,"rows_first":2000,"rows_last":500,"rows_between":2000,"halvings":0,"cell_chars":16384,"cell_head_chars":4096},"cells_cut":0,"cells_raw":0,"read":"whole","date_system":"1900"}

{"sheet":"RYBARI","index":0,"n_rows":51,"n_cols":11,"rows_kept":51,"cut":false,"hidden":false,"merged":[]}
["číslo","nč","Meno","kolo1","kolo2","kolo3","kolo4","kolo5","kolo6","kolo7","kolo8"]
[1,{"$f":"RAND()","v":0.51709331553754756},"Šenigla Peter",1,39,29,19,9,47,37,27]
[2,{"$f":"RAND()","v":0.89300716345555697},"Masarech Michal",2,12,22,32,42,4,14,24]
[3,0.93761017292487769,"Mešenec Martin",3,41,31,21,11,1,39,29]
[4,0.80921661999648531,"Drančák David",4,14,24,34,44,6,16,26]
[5,0.7166484368000936,"Vančík Juraj",5,43,33,23,13,3,41,31]
[6,0.74803709908065041,"Mašan Tomáš",6,16,26,36,46,8,18,28]
[7,9.1649265030642635E-2,"Daněk Michal",7,45,35,25,15,5,43,33]
[8,0.54656398909136328,"Kochan Ladislav",8,18,28,38,48,10,20,30]
[9,9.9587102383469572E-2,"Spáčil Matej",9,47,37,27,17,7,45,35]
{"$rows_left_out":42}
{"sheet":"seznam","index":1,"n_rows":51,"n_cols":1,"rows_kept":51,"cut":false,"hidden":true,"merged":[]}
["-"]
["Belovič Radoslav"]
["Beňo Gabriel"]
["Borovica Jozef"]
["Buršák Roman"]
["Daněk Michal"]
["Drahoš Matúš"]
["Drančák David"]
["Drgoň Martin"]
["Florek Tomáš"]
{"$rows_left_out":42}
{"sheet":"ZREBOVANIE","index":2,"n_rows":51,"n_cols":21,"rows_kept":51,"cut":false,"hidden":false,"merged":[]}
["S/L","Stanoviště","kolo1","kolo2","kolo3","kolo4","kolo5","kolo6","kolo7","kolo8",null,"počet pretekárov",47,"POSUN",10,null,null,"zavodnikuVzorec",{"$f":"IF(MOD($M$1,2)=0,$M$1,$M$1+1)","v":48},"lichý",{"$f":"MOD(M1,2)","v":1}]
[{"$f":"MOD(B2,2)","v":1},1,{"$f":"B2","v":1},{"$f":"IF(C2+$O$1>$S$1,C2+$O$1-$S$1,C2+$O$1)","v":11},21,31,41,3,13,23]
[{"$f":"MOD(B3,2)","v":0},2,{"$f":"B3","v":2},{"$f":"IF(C3-$O$1<=0,$S$1-$O$1+C3,C3-$O$1)","v":40},30,20,10,48,38,28]
[1,3,3,{"$f":"IF(C4+$O$1>$S$1,C4+$O$1-$S$1,C4+$O$1)","v":13},23,33,43,5,15,25]
[0,4,4,{"$f":"IF(C5-$O$1<=0,$S$1-$O$1+C5,C5-$O$1)","v":42},32,22,12,2,40,30]
[1,5,5,{"$f":"IF(C6+$O$1>$S$1,C6+$O$1-$S$1,C6+$O$1)","v":15},25,35,45,7,17,27]
[0,6,6,{"$f":"IF(C7-$O$1<=0,$S$1-$O$1+C7,C7-$O$1)","v":44},34,24,14,4,42,32]
[1,7,7,{"$f":"IF(C8+$O$1>$S$1,C8+$O$1-$S$1,C8+$O$1)","v":17},27,37,47,9,19,29]
[0,8,8,{"$f":"IF(C9-$O$1<=0,$S$1-$O$1+C9,C9-$O$1)","v":46},36,26,16,6,44,34]
[1,9,9,{"$f":"IF(C10+$O$1>$S$1,C10+$O$1-$S$1,C10+$O$1)","v":19},29,39,1,11,21,31]
{"$rows_left_out":42}
{"sheet":"TABULKA","index":3,"n_rows":52,"n_cols":14,"rows_kept":52,"cut":false,"hidden":false,"merged":[[0,2,0,9]]}
[null,null,"Počet rýb"]
["Pretekár","Meno",1,2,3,4,5,6,7,8,null,null,null,{"$f":"ZREBOVANIE!$M$1","v":47}]
[1,{"$f":"IF(A3<=ZREBOVANIE!$M$1,VLOOKUP(A3,RYBARI!A:C,3,0),\"x\")","v":"Šenigla Peter"},4,1,3,2,5,3,2,1,{"$f":"SUM(C3:J3)","v":21}]
[2,{"$f":"IF(A4<=ZREBOVANIE!$M$1,VLOOKUP(A4,RYBARI!A:C,3,0),\"x\")","v":"Masarech Michal"},0,0,1,1,2,1,2,0,{"$f":"SUM(C4:J4)","v":7}]
[3,{"$f":"IF(A5<=ZREBOVANIE!$M$1,VLOOKUP(A5,RYBARI!A:C,3,0),\"x\")","v":"Mešenec Martin"},1,4,2,1,4,3,2,1,18]
[4,{"$f":"IF(A6<=ZREBOVANIE!$M$1,VLOOKUP(A6,RYBARI!A:C,3,0),\"x\")","v":"Drančák David"},1,2,4,0,5,2,5,1,20]
[5,{"$f":"IF(A7<=ZREBOVANIE!$M$1,VLOOKUP(A7,RYBARI!A:C,3,0),\"x\")","v":"Vančík Juraj"},0,2,0,1,2,0,2,2,9]
[6,{"$f":"IF(A8<=ZREBOVANIE!$M$1,VLOOKUP(A8,RYBARI!A:C,3,0),\"x\")","v":"Mašan Tomáš"},2,3,4,2,4,3,2,2,22]
[7,{"$f":"IF(A9<=ZREBOVANIE!$M$1,VLOOKUP(A9,RYBARI!A:C,3,0),\"x\")","v":"Daněk Michal"},2,3,0,6,6,3,5,1,26]
[8,{"$f":"IF(A10<=ZREBOVANIE!$M$1,VLOOKUP(A10,RYBARI!A:C,3,0),\"x\")","v":"Kochan Ladislav"},3,0,0,1,2,0,2,3,11]
{"$rows_left_out":43}
{"sheet":"SÚBOJE","index":4,"n_rows":193,"n_cols":18,"rows_kept":193,"cut":false,"hidden":false,"merged":[]}
["Kolo","č1","č2","Rybár 1","Rybár 2","Počet rýb 1","Počet rýb 2","Body rybár 1","Body rybár 2",null,null,null,{"$f":"INDEX(TABULKA!$B$3:$B$52,$B1)","v":{"$error":"#VALUE!"}},{"$f":"INDEX(TABULKA!$B$3:$B$52,$C1)","v":{"$error":"#VALUE!"}},{"$f":"IF(ISBLANK(INDIRECT(ADDRESS(K1+2,$A1+2,1,1,\"tabulka\"),1)),\"-\",INDIRECT(ADDRESS(K1+2,$A1+2,1,1,\"tabulka\"),1))","v":{"$error":"#VALUE!"}},{"$f":"IF(ISBLANK(INDIRECT(ADDRESS(L1+2,$A1+2,1,1,\"tabulka\"),1)),\"-\",INDIRECT(ADDRESS(L1+2,$A1+2,1,1,\"tabulka\"),1))","v":{"$error":"#VALUE!"}},{"$f":"IF(OR($F1=\"-\",$G1=\"-\"),0,IF($F1>$G1,3,IF(AND($F1=0,$G1=0),1,IF($F1=$G1,1.5,0))))","v":0},{"$f":"IF(OR($F1=\"-\",$G1=\"-\"),0,IF($F1<$G1,3,IF(AND($F1=0,$G1=0),1,IF($F1=$G1,1.5,0))))","v":3}]
[1,1,2,{"$f":"INDEX(TABULKA!$B$3:$B$52,$B2)","v":"Šenigla Peter"},{"$f":"INDEX(TABULKA!$B$3:$B$52,$C2)","v":"Masarech Michal"},{"$f":"IF(ISBLANK(INDIRECT(ADDRESS(B2+2,$A2+2,1,1,\"tabulka\"),1)),\"-\",INDIRECT(ADDRESS(B2+2,$A2+2,1,1,\"tabulka\"),1))","v":4},{"$f":"IF(ISBLANK(INDIRECT(ADDRESS(C2+2,$A2+2,1,1,\"tabulka\"),1)),\"-\",INDIRECT(ADDRESS(C2+2,$A2+2,1,1,\"tabulka\"),1))","v":0},{"$f":"IF(OR($F2=\"-\",$G2=\"-\"),0,IF($F2>$G2,3,IF(AND($F2=0,$G2=0),1,IF($F2=$G2,1.5,0))))","v":3},{"$f":"IF(OR($F2=\"-\",$G2=\"-\"),0,IF($F2<$G2,3,IF(AND($F2=0,$G2=0),1,IF($F2=$G2,1.5,0))))","v":0}]
[1,3,4,{"$f":"INDEX(TABULKA!$B$3:$B$52,$B3)","v":"Mešenec Martin"},{"$f":"INDEX(TABULKA!$B$3:$B$52,$C3)","v":"Drančák David"},1,1,1.5,1.5]
[1,5,6,{"$f":"INDEX(TABULKA!$B$3:$B$52,$B4)","v":"Vančík Juraj"},{"$f":"INDEX(TABULKA!$B$3:$B$52,$C4)","v":"Mašan Tomáš"},0,2,0,3]
[1,7,8,{"$f":"INDEX(TABULKA!$B$3:$B$52,$B5)","v":"Daněk Michal"},{"$f":"INDEX(TABULKA!$B$3:$B$52,$C5)","v":"Kochan Ladislav"},2,3,0,3]
[1,9,10,{"$f":"INDEX(TABULKA!$B$3:$B$52,$B6)","v":"Spáčil Matej"},{"$f":"INDEX(TABULKA!$B$3:$B$52,$C6)","v":"Kollár Mikuláš"},2,5,0,3]
[1,11,12,{"$f":"INDEX(TABULKA!$B$3:$B$52,$B7)","v":"Kuhajda Rastislav"},{"$f":"INDEX(TABULKA!$B$3:$B$52,$C7)","v":"Šintál Adam"},4,4,1.5,1.5]
[1,13,14,{"$f":"INDEX(TABULKA!$B$3:$B$52,$B8)","v":"Kemencik Zoltán"},{"$f":"INDEX(TABULKA!$B$3:$B$52,$C8)","v":"Buršák Roman"},1,3,0,3]
[1,15,16,{"$f":"INDEX(TABULKA!$B$3:$B$52,$B9)","v":"Jarka Pavel"},{"$f":"INDEX(TABULKA!$B$3:$B$52,$C9)","v":"Kriho Marián"},2,5,0,3]
[1,17,18,{"$f":"INDEX(TABULKA!$B$3:$B$52,$B10)","v":"Onofrej Ivan"},{"$f":"INDEX(TABULKA!$B$3:$B$52,$C10)","v":"Smorada Marek"},1,2,0,3]
{"$rows_left_out":184}
{"sheet":"BODY","index":5,"n_rows":52,"n_cols":14,"rows_kept":52,"cut":false,"hidden":false,"merged":[[0,2,0,10]]}
[null,null,"Počet bodov"]
["Pretekár","Meno",1,2,3,4,5,6,7,8,"počet bodov celkovo","počet výhier 3 b","počet remíz 1,5b","počet rýb"]
[42,{"$f":"IF(A3<=ZREBOVANIE!$M$1,VLOOKUP(A3,RYBARI!A:C,3,0),\"x\")","v":"Petríček Jaroslav"},{"$f":"SUMIFS(SÚBOJE!$H:$H,SÚBOJE!$A:$A,C$2,SÚBOJE!$B:$B,$A3)+SUMIFS(SÚBOJE!$I:$I,SÚBOJE!$A:$A,C$2,SÚBOJE!$C:$C,$A3)","v":3},{"$f":"SUMIFS(SÚBOJE!$H:$H,SÚBOJE!$A:$A,D$2,SÚBOJE!$B:$B,$A3)+SUMIFS(SÚBOJE!$I:$I,SÚBOJE!$A:$A,D$2,SÚBOJE!$C:$C,$A3)","v":1.5},{"$f":"SUMIFS(SÚBOJE!$H:$H,SÚBOJE!$A:$A,E$2,SÚBOJE!$B:$B,$A3)+SUMIFS(SÚBOJE!$I:$I,SÚBOJE!$A:$A,E$2,SÚBOJE!$C:$C,$A3)","v":3},{"$f":"SUMIFS(SÚBOJE!$H:$H,SÚBOJE!$A:$A,F$2,SÚBOJE!$B:$B,$A3)+SUMIFS(SÚBOJE!$I:$I,SÚBOJE!$A:$A,F$2,SÚBOJE!$C:$C,$A3)","v":3},{"$f":"SUMIFS(SÚBOJE!$H:$H,SÚBOJE!$A:$A,G$2,SÚBOJE!$B:$B,$A3)+SUMIFS(SÚBOJE!$I:$I,SÚBOJE!$A:$A,G$2,SÚBOJE!$C:$C,$A3)","v":3},{"$f":"SUMIFS(SÚBOJE!$H:$H,SÚBOJE!$A:$A,H$2,SÚBOJE!$B:$B,$A3)+SUMIFS(SÚBOJE!$I:$I,SÚBOJE!$A:$A,H$2,SÚBOJE!$C:$C,$A3)","v":3},{"$f":"SUMIFS(SÚBOJE!$H:$H,SÚBOJE!$A:$A,I$2,SÚBOJE!$B:$B,$A3)+SUMIFS(SÚBOJE!$I:$I,SÚBOJE!$A:$A,I$2,SÚBOJE!$C:$C,$A3)","v":1.5},{"$f":"SUMIFS(SÚBOJE!$H:$H,SÚBOJE!$A:$A,J$2,SÚBOJE!$B:$B,$A3)+SUMIFS(SÚBOJE!$I:$I,SÚBOJE!$A:$A,J$2,SÚBOJE!$C:$C,$A3)","v":3},{"$f":"SUM(C3:J3)","v":21},{"$f":"COUNTIFS(SÚBOJE!$B:$B,$A3,SÚBOJE!$H:$H,3)+COUNTIFS(SÚBOJE!$C:$C,$A3,SÚBOJE!$I:$I,3)","v":6},{"$f":"COUNTIFS(SÚBOJE!$B:$B,$A3,SÚBOJE!$H:$H,1.5)+COUNTIFS(SÚBOJE!$C:$C,$A3,SÚBOJE!$I:$I,1.5)","v":2},{"$f":"SUMIF(TABULKA!$A$3:$A$52,$A3,TABULKA!$K$3:$K$52)","v":27}]
[22,{"$f":"IF(A4<=ZREBOVANIE!$M$1,VLOOKUP(A4,RYBARI!A:C,3,0),\"x\")","v":"Belovič Radoslav"},{"$f":"SUMIFS(SÚBOJE!$H:$H,SÚBOJE!$A:$A,C$2,SÚBOJE!$B:$B,$A4)+SUMIFS(SÚBOJE!$I:$I,SÚBOJE!$A:$A,C$2,SÚBOJE!$C:$C,$A4)","v":3},{"$f":"SUMIFS(SÚBOJE!$H:$H,SÚBOJE!$A:$A,D$2,SÚBOJE!$B:$B,$A4)+SUMIFS(SÚBOJE!$I:$I,SÚBOJE!$A:$A,D$2,SÚBOJE!$C:$C,$A4)","v":3},{"$f":"SUMIFS(SÚBOJE!$H:$H,SÚBOJE!$A:$A,E$2,SÚBOJE!$B:$B,$A4)+SUMIFS(SÚBOJE!$I:$I,SÚBOJE!$A:$A,E$2,SÚBOJE!$C:$C,$A4)","v":3},{"$f":"SUMIFS(SÚBOJE!$H:$H,SÚBOJE!$A:$A,F$2,SÚBOJE!$B:$B,$A4)+SUMIFS(SÚBOJE!$I:$I,SÚBOJE!$A:$A,F$2,SÚBOJE!$C:$C,$A4)","v":3},{"$f":"SUMIFS(SÚBOJE!$H:$H,SÚBOJE!$A:$A,G$2,SÚBOJE!$B:$B,$A4)+SUMIFS(SÚBOJE!$I:$I,SÚBOJE!$A:$A,G$2,SÚBOJE!$C:$C,$A4)","v":1.5},{"$f":"SUMIFS(SÚBOJE!$H:$H,SÚBOJE!$A:$A,H$2,SÚBOJE!$B:$B,$A4)+SUMIFS(SÚBOJE!$I:$I,SÚBOJE!$A:$A,H$2,SÚBOJE!$C:$C,$A4)","v":0},{"$f":"SUMIFS(SÚBOJE!$H:$H,SÚBOJE!$A:$A,I$2,SÚBOJE!$B:$B,$A4)+SUMIFS(SÚBOJE!$I:$I,SÚBOJE!$A:$A,I$2,SÚBOJE!$C:$C,$A4)","v":3},{"$f":"SUMIFS(SÚBOJE!$H:$H,SÚBOJE!$A:$A,J$2,SÚBOJE!$B:$B,$A4)+SUMIFS(SÚBOJE!$I:$I,SÚBOJE!$A:$A,J$2,SÚBOJE!$C:$C,$A4)","v":3},19.5,{"$f":"COUNTIFS(SÚBOJE!$B:$B,$A4,SÚBOJE!$H:$H,3)+COUNTIFS(SÚBOJE!$C:$C,$A4,SÚBOJE!$I:$I,3)","v":6},{"$f":"COUNTIFS(SÚBOJE!$B:$B,$A4,SÚBOJE!$H:$H,1.5)+COUNTIFS(SÚBOJE!$C:$C,$A4,SÚBOJE!$I:$I,1.5)","v":1},{"$f":"SUMIF(TABULKA!$A$3:$A$52,$A4,TABULKA!$K$3:$K$52)","v":34}]
[16,{"$f":"IF(A5<=ZREBOVANIE!$M$1,VLOOKUP(A5,RYBARI!A:C,3,0),\"x\")","v":"Kriho Marián"},{"$f":"SUMIFS(SÚBOJE!$H:$H,SÚBOJE!$A:$A,C$2,SÚBOJE!$B:$B,$A5)+SUMIFS(SÚBOJE!$I:$I,SÚBOJE!$A:$A,C$2,SÚBOJE!$C:$C,$A5)","v":3},{"$f":"SUMIFS(SÚBOJE!$H:$H,SÚBOJE!$A:$A,D$2,SÚBOJE!$B:$B,$A5)+SUMIFS(SÚBOJE!$I:$I,SÚBOJE!$A:$A,D$2,SÚBOJE!$C:$C,$A5)","v":1.5},{"$f":"SUMIFS(SÚBOJE!$H:$H,SÚBOJE!$A:$A,E$2,SÚBOJE!$B:$B,$A5)+SUMIFS(SÚBOJE!$I:$I,SÚBOJE!$A:$A,E$2,SÚBOJE!$C:$C,$A5)","v":3},{"$f":"SUMIFS(SÚBOJE!$H:$H,SÚBOJE!$A:$A,F$2,SÚBOJE!$B:$B,$A5)+SUMIFS(SÚBOJE!$I:$I,SÚBOJE!$A:$A,F$2,SÚBOJE!$C:$C,$A5)","v":3},{"$f":"SUMIFS(SÚBOJE!$H:$H,SÚBOJE!$A:$A,G$2,SÚBOJE!$B:$B,$A5)+SUMIFS(SÚBOJE!$I:$I,SÚBOJE!$A:$A,G$2,SÚBOJE!$C:$C,$A5)","v":0},{"$f":"SUMIFS(SÚBOJE!$H:$H,SÚBOJE!$A:$A,H$2,SÚBOJE!$B:$B,$A5)+SUMIFS(SÚBOJE!$I:$I,SÚBOJE!$A:$A,H$2,SÚBOJE!$C:$C,$A5)","v":3},{"$f":"SUMIFS(SÚBOJE!$H:$H,SÚBOJE!$A:$A,I$2,SÚBOJE!$B:$B,$A5)+SUMIFS(SÚBOJE!$I:$I,SÚBOJE!$A:$A,I$2,SÚBOJE!$C:$C,$A5)","v":3},{"$f":"SUMIFS(SÚBOJE!$H:$H,SÚBOJE!$A:$A,J$2,SÚBOJE!$B:$B,$A5)+SUMIFS(SÚBOJE!$I:$I,SÚBOJE!$A:$A,J$2,SÚBOJE!$C:$C,$A5)","v":3},19.5,{"$f":"COUNTIFS(SÚBOJE!$B:$B,$A5,SÚBOJE!$H:$H,3)+COUNTIFS(SÚBOJE!$C:$C,$A5,SÚBOJE!$I:$I,3)","v":6},{"$f":"COUNTIFS(SÚBOJE!$B:$B,$A5,SÚBOJE!$H:$H,1.5)+COUNTIFS(SÚBOJE!$C:$C,$A5,SÚBOJE!$I:$I,1.5)","v":1},{"$f":"SUMIF(TABULKA!$A$3:$A$52,$A5,TABULKA!$K$3:$K$52)","v":24}]
[6,{"$f":"IF(A6<=ZREBOVANIE!$M$1,VLOOKUP(A6,RYBARI!A:C,3,0),\"x\")","v":"Mašan Tomáš"},{"$f":"SUMIFS(SÚBOJE!$H:$H,SÚBOJE!$A:$A,C$2,SÚBOJE!$B:$B,$A6)+SUMIFS(SÚBOJE!$I:$I,SÚBOJE!$A:$A,C$2,SÚBOJE!$C:$C,$A6)","v":3},{"$f":"SUMIFS(SÚBOJE!$H:$H,SÚBOJE!$A:$A,D$2,SÚBOJE!$B:$B,$A6)+SUMIFS(SÚBOJE!$I:$I,SÚBOJE!$A:$A,D$2,SÚBOJE!$C:$C,$A6)","v":1.5},{"$f":"SUMIFS(SÚBOJE!$H:$H,SÚBOJE!$A:$A,E$2,SÚBOJE!$B:$B,$A6)+SUMIFS(SÚBOJE!$I:$I,SÚBOJE!$A:$A,E$2,SÚBOJE!$C:$C,$A6)","v":3},{"$f":"SUMIFS(SÚBOJE!$H:$H,SÚBOJE!$A:$A,F$2,SÚBOJE!$B:$B,$A6)+SUMIFS(SÚBOJE!$I:$I,SÚBOJE!$A:$A,F$2,SÚBOJE!$C:$C,$A6)","v":3},{"$f":"SUMIFS(SÚBOJE!$H:$H,SÚBOJE!$A:$A,G$2,SÚBOJE!$B:$B,$A6)+SUMIFS(SÚBOJE!$I:$I,SÚBOJE!$A:$A,G$2,SÚBOJE!$C:$C,$A6)","v":3},{"$f":"SUMIFS(SÚBOJE!$H:$H,SÚBOJE!$A:$A,H$2,SÚBOJE!$B:$B,$A6)+SUMIFS(SÚBOJE!$I:$I,SÚBOJE!$A:$A,H$2,SÚBOJE!$C:$C,$A6)","v":3},{"$f":"SUMIFS(SÚBOJE!$H:$H,SÚBOJE!$A:$A,I$2,SÚBOJE!$B:$B,$A6)+SUMIFS(SÚBOJE!$I:$I,SÚBOJE!$A:$A,I$2,SÚBOJE!$C:$C,$A6)","v":0},{"$f":"SUMIFS(SÚBOJE!$H:$H,SÚBOJE!$A:$A,J$2,SÚBOJE!$B:$B,$A6)+SUMIFS(SÚBOJE!$I:$I,SÚBOJE!$A:$A,J$2,SÚBOJE!$C:$C,$A6)","v":3},19.5,{"$f":"COUNTIFS(SÚBOJE!$B:$B,$A6,SÚBOJE!$H:$H,3)+COUNTIFS(SÚBOJE!$C:$C,$A6,SÚBOJE!$I:$I,3)","v":6},{"$f":"COUNTIFS(SÚBOJE!$B:$B,$A6,SÚBOJE!$H:$H,1.5)+COUNTIFS(SÚBOJE!$C:$C,$A6,SÚBOJE!$I:$I,1.5)","v":1},{"$f":"SUMIF(TABULKA!$A$3:$A$52,$A6,TABULKA!$K$3:$K$52)","v":22}]
[7,{"$f":"IF(A7<=ZREBOVANIE!$M$1,VLOOKUP(A7,RYBARI!A:C,3,0),\"x\")","v":"Daněk Michal"},{"$f":"SUMIFS(SÚBOJE!$H:$H,SÚBOJE!$A:$A,C$2,SÚBOJE!$B:$B,$A7)+SUMIFS(SÚBOJE!$I:$I,SÚBOJE!$A:$A,C$2,SÚBOJE!$C:$C,$A7)","v":0},{"$f":"SUMIFS(SÚBOJE!$H:$H,SÚBOJE!$A:$A,D$2,SÚBOJE!$B:$B,$A7)+SUMIFS(SÚBOJE!$I:$I,SÚBOJE!$A:$A,D$2,SÚBOJE!$C:$C,$A7)","v":3},{"$f":"SUMIFS(SÚBOJE!$H:$H,SÚBOJE!$A:$A,E$2,SÚBOJE!$B:$B,$A7)+SUMIFS(SÚBOJE!$I:$I,SÚBOJE!$A:$A,E$2,SÚBOJE!$C:$C,$A7)","v":0},{"$f":"SUMIFS(SÚBOJE!$H:$H,SÚBOJE!$A:$A,F$2,SÚBOJE!$B:$B,$A7)+SUMIFS(SÚBOJE!$I:$I,SÚBOJE!$A:$A,F$2,SÚBOJE!$C:$C,$A7)","v":3},{"$f":"SUMIFS(SÚBOJE!$H:$H,SÚBOJE!$A:$A,G$2,SÚBOJE!$B:$B,$A7)+SUMIFS(SÚBOJE!$I:$I,SÚBOJE!$A:$A,G$2,SÚBOJE!$C:$C,$A7)","v":3},{"$f":"SUMIFS(SÚBOJE!$H:$H,SÚBOJE!$A:$A,H$2,SÚBOJE!$B:$B,$A7)+SUMIFS(SÚBOJE!$I:$I,SÚBOJE!$A:$A,H$2,SÚBOJE!$C:$C,$A7)","v":3},{"$f":"SUMIFS(SÚBOJE!$H:$H,SÚBOJE!$A:$A,I$2,SÚBOJE!$B:$B,$A7)+SUMIFS(SÚBOJE!$I:$I,SÚBOJE!$A:$A,I$2,SÚBOJE!$C:$C,$A7)","v":3},{"$f":"SUMIFS(SÚBOJE!$H:$H,SÚBOJE!$A:$A,J$2,SÚBOJE!$B:$B,$A7)+SUMIFS(SÚBOJE!$I:$I,SÚBOJE!$A:$A,J$2,SÚBOJE!$C:$C,$A7)","v":3},18,{"$f":"COUNTIFS(SÚBOJE!$B:$B,$A7,SÚBOJE!$H:$H,3)+COUNTIFS(SÚBOJE!$C:$C,$A7,SÚBOJE!$I:$I,3)","v":6},{"$f":"COUNTIFS(SÚBOJE!$B:$B,$A7,SÚBOJE!$H:$H,1.5)+COUNTIFS(SÚBOJE!$C:$C,$A7,SÚBOJE!$I:$I,1.5)","v":0},{"$f":"SUMIF(TABULKA!$A$3:$A$52,$A7,TABULKA!$K$3:$K$52)","v":26}]
[20,{"$f":"IF(A8<=ZREBOVANIE!$M$1,VLOOKUP(A8,RYBARI!A:C,3,0),\"x\")","v":"Mičo Martin"},{"$f":"SUMIFS(SÚBOJE!$H:$H,SÚBOJE!$A:$A,C$2,SÚBOJE!$B:$B,$A8)+SUMIFS(SÚBOJE!$I:$I,SÚBOJE!$A:$A,C$2,SÚBOJE!$C:$C,$A8)","v":3},{"$f":"SUMIFS(SÚBOJE!$H:$H,SÚBOJE!$A:$A,D$2,SÚBOJE!$B:$B,$A8)+SUMIFS(SÚBOJE!$I:$I,SÚBOJE!$A:$A,D$2,SÚBOJE!$C:$C,$A8)","v":3},{"$f":"SUMIFS(SÚBOJE!$H:$H,SÚBOJE!$A:$A,E$2,SÚBOJE!$B:$B,$A8)+SUMIFS(SÚBOJE!$I:$I,SÚBOJE!$A:$A,E$2,SÚBOJE!$C:$C,$A8)","v":3},{"$f":"SUMIFS(SÚBOJE!$H:$H,SÚBOJE!$A:$A,F$2,SÚBOJE!$B:$B,$A8)+SUMIFS(SÚBOJE!$I:$I,SÚBOJE!$A:$A,F$2,SÚBOJE!$C:$C,$A8)","v":3},{"$f":"SUMIFS(SÚBOJE!$H:$H,SÚBOJE!$A:$A,G$2,SÚBOJE!$B:$B,$A8)+SUMIFS(SÚBOJE!$I:$I,SÚBOJE!$A:$A,G$2,SÚBOJE!$C:$C,$A8)","v":0},{"$f":"SUMIFS(SÚBOJE!$H:$H,SÚBOJE!$A:$A,H$2,SÚBOJE!$B:$B,$A8)+SUMIFS(SÚBOJE!$I:$I,SÚBOJE!$A:$A,H$2,SÚBOJE!$C:$C,$A8)","v":3},{"$f":"SUMIFS(SÚBOJE!$H:$H,SÚBOJE!$A:$A,I$2,SÚBOJE!$B:$B,$A8)+SUMIFS(SÚBOJE!$I:$I,SÚBOJE!$A:$A,I$2,SÚBOJE!$C:$C,$A8)","v":3},{"$f":"SUMIFS(SÚBOJE!$H:$H,SÚBOJE!$A:$A,J$2,SÚBOJE!$B:$B,$A8)+SUMIFS(SÚBOJE!$I:$I,SÚBOJE!$A:$A,J$2,SÚBOJE!$C:$C,$A8)","v":0},18,{"$f":"COUNTIFS(SÚBOJE!$B:$B,$A8,SÚBOJE!$H:$H,3)+COUNTIFS(SÚBOJE!$C:$C,$A8,SÚBOJE!$I:$I,3)","v":6},{"$f":"COUNTIFS(SÚBOJE!$B:$B,$A8,SÚBOJE!$H:$H,1.5)+COUNTIFS(SÚBOJE!$C:$C,$A8,SÚBOJE!$I:$I,1.5)","v":0},{"$f":"SUMIF(TABULKA!$A$3:$A$52,$A8,TABULKA!$K$3:$K$52)","v":24}]
[32,{"$f":"IF(A9<=ZREBOVANIE!$M$1,VLOOKUP(A9,RYBARI!A:C,3,0),\"x\")","v":"Zrubec Róbert"},{"$f":"SUMIFS(SÚBOJE!$H:$H,SÚBOJE!$A:$A,C$2,SÚBOJE!$B:$B,$A9)+SUMIFS(SÚBOJE!$I:$I,SÚBOJE!$A:$A,C$2,SÚBOJE!$C:$C,$A9)","v":3},{"$f":"SUMIFS(SÚBOJE!$H:$H,SÚBOJE!$A:$A,D$2,SÚBOJE!$B:$B,$A9)+SUMIFS(SÚBOJE!$I:$I,SÚBOJE!$A:$A,D$2,SÚBOJE!$C:$C,$A9)","v":3},{"$f":"SUMIFS(SÚBOJE!$H:$H,SÚBOJE!$A:$A,E$2,SÚBOJE!$B:$B,$A9)+SUMIFS(SÚBOJE!$I:$I,SÚBOJE!$A:$A,E$2,SÚBOJE!$C:$C,$A9)","v":3},{"$f":"SUMIFS(SÚBOJE!$H:$H,SÚBOJE!$A:$A,F$2,SÚBOJE!$B:$B,$A9)+SUMIFS(SÚBOJE!$I:$I,SÚBOJE!$A:$A,F$2,SÚBOJE!$C:$C,$A9)","v":3},{"$f":"SUMIFS(SÚBOJE!$H:$H,SÚBOJE!$A:$A,G$2,SÚBOJE!$B:$B,$A9)+SUMIFS(SÚBOJE!$I:$I,SÚBOJE!$A:$A,G$2,SÚBOJE!$C:$C,$A9)","v":3},{"$f":"SUMIFS(SÚBOJE!$H:$H,SÚBOJE!$A:$A,H$2,SÚBOJE!$B:$B,$A9)+SUMIFS(SÚBOJE!$I:$I,SÚBOJE!$A:$A,H$2,SÚBOJE!$C:$C,$A9)","v":0},{"$f":"SUMIFS(SÚBOJE!$H:$H,SÚBOJE!$A:$A,I$2,SÚBOJE!$B:$B,$A9)+SUMIFS(SÚBOJE!$I:$I,SÚBOJE!$A:$A,I$2,SÚBOJE!$C:$C,$A9)","v":0},{"$f":"SUMIFS(SÚBOJE!$H:$H,SÚBOJE!$A:$A,J$2,SÚBOJE!$B:$B,$A9)+SUMIFS(SÚBOJE!$I:$I,SÚBOJE!$A:$A,J$2,SÚBOJE!$C:$C,$A9)","v":3},18,{"$f":"COUNTIFS(SÚBOJE!$B:$B,$A9,SÚBOJE!$H:$H,3)+COUNTIFS(SÚBOJE!$C:$C,$A9,SÚBOJE!$I:$I,3)","v":6},{"$f":"COUNTIFS(SÚBOJE!$B:$B,$A9,SÚBOJE!$H:$H,1.5)+COUNTIFS(SÚBOJE!$C:$C,$A9,SÚBOJE!$I:$I,1.5)","v":0},{"$f":"SUMIF(TABULKA!$A$3:$A$52,$A9,TABULKA!$K$3:$K$52)","v":24}]
[30,{"$f":"IF(A10<=ZREBOVANIE!$M$1,VLOOKUP(A10,RYBARI!A:C,3,0),\"x\")","v":"Borovica Jozef"},{"$f":"SUMIFS(SÚBOJE!$H:$H,SÚBOJE!$A:$A,C$2,SÚBOJE!$B:$B,$A10)+SUMIFS(SÚBOJE!$I:$I,SÚBOJE!$A:$A,C$2,SÚBOJE!$C:$C,$A10)","v":3},{"$f":"SUMIFS(SÚBOJE!$H:$H,SÚBOJE!$A:$A,D$2,SÚBOJE!$B:$B,$A10)+SUMIFS(SÚBOJE!$I:$I,SÚBOJE!$A:$A,D$2,SÚBOJE!$C:$C,$A10)","v":3},{"$f":"SUMIFS(SÚBOJE!$H:$H,SÚBOJE!$A:$A,E$2,SÚBOJE!$B:$B,$A10)+SUMIFS(SÚBOJE!$I:$I,SÚBOJE!$A:$A,E$2,SÚBOJE!$C:$C,$A10)","v":3},{"$f":"SUMIFS(SÚBOJE!$H:$H,SÚBOJE!$A:$A,F$2,SÚBOJE!$B:$B,$A10)+SUMIFS(SÚBOJE!$I:$I,SÚBOJE!$A:$A,F$2,SÚBOJE!$C:$C,$A10)","v":3},{"$f":"SUMIFS(SÚBOJE!$H:$H,SÚBOJE!$A:$A,G$2,SÚBOJE!$B:$B,$A10)+SUMIFS(SÚBOJE!$I:$I,SÚBOJE!$A:$A,G$2,SÚBOJE!$C:$C,$A10)","v":0},{"$f":"SUMIFS(SÚBOJE!$H:$H,SÚBOJE!$A:$A,H$2,SÚBOJE!$B:$B,$A10)+SUMIFS(SÚBOJE!$I:$I,SÚBOJE!$A:$A,H$2,SÚBOJE!$C:$C,$A10)","v":1},{"$f":"SUMIFS(SÚBOJE!$H:$H,SÚBOJE!$A:$A,I$2,SÚBOJE!$B:$B,$A10)+SUMIFS(SÚBOJE!$I:$I,SÚBOJE!$A:$A,I$2,SÚBOJE!$C:$C,$A10)","v":1.5},{"$f":"SUMIFS(SÚBOJE!$H:$H,SÚBOJE!$A:$A,J$2,SÚBOJE!$B:$B,$A10)+SUMIFS(SÚBOJE!$I:$I,SÚBOJE!$A:$A,J$2,SÚBOJE!$C:$C,$A10)","v":3},17.5,{"$f":"COUNTIFS(SÚBOJE!$B:$B,$A10,SÚBOJE!$H:$H,3)+COUNTIFS(SÚBOJE!$C:$C,$A10,SÚBOJE!$I:$I,3)","v":5},{"$f":"COUNTIFS(SÚBOJE!$B:$B,$A10,SÚBOJE!$H:$H,1.5)+COUNTIFS(SÚBOJE!$C:$C,$A10,SÚBOJE!$I:$I,1.5)","v":1},{"$f":"SUMIF(TABULKA!$A$3:$A$52,$A10,TABULKA!$K$3:$K$52)","v":19}]
{"$rows_left_out":43}
{"sheet":"varianty","index":6,"n_rows":86,"n_cols":2,"rows_kept":86,"cut":false,"hidden":true,"merged":[]}
["závodníků","posun"]
[30,2]
[30,3]
[30,4]
[30,8]
[30,9]
[31,2]
[31,6]
[31,10]
[32,2]
{"$rows_left_out":76}